Build: #331 failed Changes by Eric Milles

Build result summary

Details

Completed
Duration
104 minutes
Labels
None
Agent
bamboo-16.af.pivotal.io
Revision
d8d53d2497ae77f8afad2a6905ecb033cc6171d1 d8d53d2497ae77f8afad2a6905ecb033cc6171d1
Total tests
5729
Failing since
#325 (Changes by Eric Milles)
Fixed in
#347 (Changes by Eric Milles)

Responsible

Code commits

Author Commit Message Commit date
Eric Milles Eric Milles d8d53d2497ae77f8afad2a6905ecb033cc6171d1 d8d53d2497ae77f8afad2a6905ecb033cc6171d1 GROOVY-9136

Tests

New test failures 4
Status Test View job Duration
Collapse Failed GroovyCompilationUnitTests testSingleMemberAnnotation1 History
Default Job < 1 sec
java.lang.RuntimeException: Java Model Exception: Java Model Status [Build path contains duplicate entry: 'org.eclipse.jdt.launching.JRE_CONTAINER' for project 'Project']
	at org.eclipse.jdt.core.groovy.tests.model.GroovyCompilationUnitTests.testSingleMemberAnnotation1(GroovyCompilationUnitTests.java:431)
Caused by: org.eclipse.jdt.core.JavaModelException: Build path contains duplicate entry: 'org.eclipse.jdt.launching.JRE_CONTAINER' for project 'Project'
	at org.eclipse.jdt.core.groovy.tests.model.GroovyCompilationUnitTests.testSingleMemberAnnotation1(GroovyCompilationUnitTests.java:431)
Collapse Failed GroovyCompilationUnitTests testVariadicMethod1 History
Default Job < 1 sec
java.lang.RuntimeException: Java Model Exception: Java Model Status [Build path contains duplicate entry: 'org.eclipse.jdt.launching.JRE_CONTAINER' for project 'Project']
	at org.eclipse.jdt.core.groovy.tests.model.GroovyCompilationUnitTests.testVariadicMethod1(GroovyCompilationUnitTests.java:771)
Caused by: org.eclipse.jdt.core.JavaModelException: Build path contains duplicate entry: 'org.eclipse.jdt.launching.JRE_CONTAINER' for project 'Project'
	at org.eclipse.jdt.core.groovy.tests.model.GroovyCompilationUnitTests.testVariadicMethod1(GroovyCompilationUnitTests.java:771)
Collapse Failed ClosureInferencingTests testNestedClosure16 History
Default Job < 1 sec
java.lang.AssertionError: Expected type not found.
Expected: java.lang.Boolean
Found: java.lang.Object
Declaring type: groovy.lang.Closure
ASTNode: org.codehaus.groovy.ast.expr.ConstantExpression@12c643[meth]
Confidence: UNKNOWN

java.lang.AssertionError: 
(8 more lines...)
Collapse Failed Groovy21InferencingTests testTypeCheckingExtension History
Default Job < 1 sec
java.lang.AssertionError: Expected type not found.
Expected: java.lang.Void
Found: java.lang.String
Declaring type: java.lang.Object
ASTNode: org.codehaus.groovy.ast.expr.ConstantExpression@11704d[move]
Confidence: UNKNOWN

java.lang.AssertionError: 
(8 more lines...)
Existing test failures 3
Status Test Failing since View job Duration
org.junit.ComparisonFailure: unexpected recompiled units. lenExpected=3 lenActual=4 expected:<...st.Class1,test.Class[]2,test.Class3}> but was:<...st.Class1,test.Class[1,test.Class]2,test.Class3}>
	at org.eclipse.jdt.core.groovy.tests.builder.BasicGroovyBuildTests.testGRE1773(BasicGroovyBuildTests.java:3422)
org.junit.runners.model.TestTimedOutException: test timed out after 1500 milliseconds
	at org.eclipse.jdt.groovy.core.tests.basic.EnumerationTests.testEnum4438(EnumerationTests.java:316)
org.junit.runners.model.TestTimedOutException: test timed out after 1500 milliseconds
	at org.eclipse.jdt.groovy.core.tests.basic.EnumerationTests.testEnum4438(EnumerationTests.java:316)
Fixed tests 3
Status Test Failing since View job Duration
Successful BuildAccessRulesTests testAccessForMethodReturnType History
Failing since build #330 (Changes by Eric Milles) Default Job < 1 sec
Successful DGMInferencingTests testDGM46 History
Failing since build #330 (Changes by Eric Milles) Default Job < 1 sec
Successful GenericInferencingTests testMap15 History
Failing since build #330 (Changes by Eric Milles) Default Job < 1 sec

Jira issues

IssueDescriptionStatus
Unknown Issue TypeGROOVY-9136Could not obtain issue details from Jira