Build: #400 failed Changes by Eric Milles

Build result summary

Details

Completed
Duration
109 minutes
Labels
None
Agent
bamboo-15.af.pivotal.io
Revision
102f4c0e2cbc04d2cfc58f908610c001335d95e0 102f4c0e2cbc04d2cfc58f908610c001335d95e0
Total tests
5955
Failing since
#399 (Changes by Eric Milles)
Fixed in
#413 (Changes by Eric Milles)

Responsible

Code commits

Author Commit Message Commit date
Eric Milles Eric Milles 102f4c0e2cbc04d2cfc58f908610c001335d95e0 102f4c0e2cbc04d2cfc58f908610c001335d95e0 Fix for #920: create type signature for types in method's binding key
Ex: hover over "getClass()" which has wildcard type Class<?>
Eric Milles Eric Milles d0d6a9705f2373cac68b72868026e4bfa3634c17 d0d6a9705f2373cac68b72868026e4bfa3634c17 GROOVY-9199

Tests

New test failures 5
Status Test View job Duration
Collapse Failed JUnit3TestFinderTests testFindAllTestSuites History
Default Job 4 secs
java.lang.AssertionError: Should have found 3 test classes. Expression: (testTypes.size() == 3)
	at org.codehaus.groovy.eclipse.junit.test.JUnit3TestFinderTests.testFindAllTestSuites(JUnit3TestFinderTests.groovy:110)
Collapse Failed BasicGroovyBuildTests testInners_983 History
Default Job < 1 sec
org.junit.ComparisonFailure: unexpected recompiled units. lenExpected=3 lenActual=1 expected:<{Client[,Outer,Outer$Inner]}> but was:<{Client[]}>
	at org.eclipse.jdt.core.groovy.tests.builder.BasicGroovyBuildTests.testInners_983(BasicGroovyBuildTests.java:338)
Collapse Failed BasicGroovyBuildTests testSlow_GRE870 History
Default Job < 1 sec
org.junit.ComparisonFailure: unexpected recompiled units. lenExpected=2 lenActual=4 expected:<{Foo,[]Test1}> but was:<{Foo,[Foo,Test1,]Test1}>
	at org.eclipse.jdt.core.groovy.tests.builder.BasicGroovyBuildTests.testSlow_GRE870(BasicGroovyBuildTests.java:1646)
Collapse Failed BinarySearchTests testFieldRefInInitializer History
Default Job 1 sec
java.lang.AssertionError: Expecting 1 matches, but found 0

java.lang.AssertionError: 
Expecting 1 matches, but found 0

	at org.eclipse.jdt.core.groovy.tests.search.BinarySearchTests.assertMatches(BinarySearchTests.java:135)
	at org.eclipse.jdt.core.groovy.tests.search.BinarySearchTests.testFieldRefInInitializer(BinarySearchTests.java:204)
Collapse Failed BinarySearchTests testFieldDecl2 History
Default Job 1 sec
java.lang.AssertionError: Expecting 2 matches, but found 0

java.lang.AssertionError: 
Expecting 2 matches, but found 0

	at org.eclipse.jdt.core.groovy.tests.search.BinarySearchTests.assertMatches(BinarySearchTests.java:135)
	at org.eclipse.jdt.core.groovy.tests.search.BinarySearchTests.testFieldDecl2(BinarySearchTests.java:186)
Fixed tests 2
Status Test Failing since View job Duration
Successful BuildAccessRulesTests testAccessForMethodParameter History
Failing since build #399 (Changes by Eric Milles) Default Job < 1 sec
Successful BuildAccessRulesTests testAccessForMethodReturnTypeGenerics History
Failing since build #399 (Changes by Eric Milles) Default Job < 1 sec

Jira issues

IssueDescriptionStatus
Unknown Issue TypeGROOVY-9199Could not obtain issue details from Jira