Build: #461 failed Changes by Eric Milles

Build result summary

Details

Completed
Duration
91 minutes
Labels
None
Agent
bamboo-17.af.pivotal.io
Revision
aae9f0da6af9909a004643dcf59398ef64abbf23 aae9f0da6af9909a004643dcf59398ef64abbf23
Total tests
6041
Failing since
#448 (Changes by Eric Milles)

Responsible

Code commits

Author Commit Message Commit date
Eric Milles Eric Milles aae9f0da6af9909a004643dcf59398ef64abbf23 aae9f0da6af9909a004643dcf59398ef64abbf23 GROOVY-6148: fix code select for "var" and "final" in multi-declaration
    def (a, b) = ...
    var (c, d) = ...
    final (e, f) = ...

Tests

New test failures 43
Status Test View job Duration
Collapse Failed RenameFieldTests test10 History
Default Job 5 secs
org.junit.ComparisonFailure: invalid renaming expected:<...ef s() {
        "${[g}"
        "${this.g]}"
    }
}> but was:<...ef s() {
        "${[f}"
        "${this.f]}"
    }
(15 more lines...)
Collapse Failed RenameFieldTests test11 History
Default Job 1 sec
org.junit.ComparisonFailure: invalid renaming expected:<...port static o.Other.[BAR

BAR
o.Other.BAR]> but was:<...port static o.Other.[FOO

FOO
o.Other.FOO]>
org.junit.ComparisonFailure: 
(9 more lines...)
Collapse Failed RenameFieldTests test4 History
Default Job 1 sec
org.junit.ComparisonFailure: invalid renaming expected:<...     this.f = super.[g]
    }
}

class A {
...> but was:<...     this.f = super.[f]
    }
}
(19 more lines...)
Collapse Failed RenameFieldTests test14 History
Default Job 1 sec
org.junit.ComparisonFailure: invalid renaming expected:<...tBar(Class bar) {
  [baz = bar
 }
}

@CompileStatic
class A {
 def f = new MyBean()
(41 more lines...)
Collapse Failed RenameFieldTests test13 History
Default Job 1 sec
org.junit.ComparisonFailure: invalid renaming expected:<...2 = new MyBean(foo: [g].foo)
 }
}> but was:<...2 = new MyBean(foo: [f].foo)
 }
}>
org.junit.ComparisonFailure: 
invalid renaming expected:<...2 = new MyBean(foo: [g].foo)
	}
(5 more lines...)
Collapse Failed RenameFieldTests test3 History
Default Job 1 sec
org.junit.ComparisonFailure: invalid renaming expected:<... void s() {
        [g = g
        this.g = super.g
    }
}

class A extends C {
    def g = 7
(59 more lines...)
Collapse Failed RenameFieldTests test6 History
Default Job 1 sec
org.junit.ComparisonFailure: invalid renaming expected:<... {
        f = this.[g]
    }
}> but was:<... {
        f = this.[f]
    }
}>
org.junit.ComparisonFailure: 
(11 more lines...)
Collapse Failed RenameFieldTests testInitializer1 History
Default Job 1 sec
org.junit.ComparisonFailure: invalid renaming expected:<... p
class A { 
    { [g }
    def g
    def other = g
    def doOperation= { g }
    { g] }
}> but was:<... p
(27 more lines...)
Collapse Failed RenameFieldTests testInitializer2 History
Default Job 1 sec
org.junit.ComparisonFailure: invalid renaming expected:<... 
    A() { }
    { [g }
    def g
    def other = g
    def doOperation= { g }
    { g] }
}> but was:<... 
(27 more lines...)
Collapse Failed RenameFieldTests testInitializer3 History
Default Job 1 sec
org.junit.ComparisonFailure: invalid renaming expected:<...   A(a,b) { }
    { [g }
    def g
    def other = g
    def doOperation= { g }
    { g] }
}> but was:<...   A(a,b) { }
    { [f }
(23 more lines...)
Collapse Failed RenameFieldTests testScript2 History
Default Job 1 sec
org.junit.ComparisonFailure: invalid renaming expected:<...f val = new C()
val.[g

def val2 = ""
val2.f
val2 = val
val2.g]

(34 more lines...)
Collapse Failed RenameFieldTests testScript1 History
Default Job 1 sec
org.junit.ComparisonFailure: invalid renaming expected:<...f val = new B()
val.[g

def val2 = ""
val2.f
val2 = val
val2.g]

(42 more lines...)
Collapse Failed RenameFieldTests test9 History
Default Job 1 sec
org.junit.ComparisonFailure: invalid renaming expected:<...c def s() {
        [g = A.g
    }
}

class B extends A {
    public def f
    void m() {
(59 more lines...)
Collapse Failed RenameFieldTests test7 History
Default Job 1 sec
org.junit.ComparisonFailure: invalid renaming expected:<...->
        f = this.[g]
    }
}> but was:<...->
        f = this.[f]
    }
}>
org.junit.ComparisonFailure: 
(10 more lines...)
Collapse Failed RenameFieldTests test8 History
Default Job 1 sec
org.junit.ComparisonFailure: invalid renaming expected:<...s() {
        f = A.[g
        f = super.g
    }
}

class A extends C {
    static g = 7
(63 more lines...)
Collapse Failed RenameFieldTests test2 History
Default Job 1 sec
org.junit.ComparisonFailure: invalid renaming expected:<...oid s() {
        c.[g = 3
        def f =  {f -> println(f)}
        c.g()
    }
}

class A {
(51 more lines...)
Collapse Failed RenameFieldTests test5 History
Default Job 1 sec
org.junit.ComparisonFailure: invalid renaming expected:<...s A {
    {
        [g = g
        while (true) {
            def f = this.g
            f++
        }
        g]++
(34 more lines...)
Collapse Failed RenameMethodTests testEnumOverrides2 History
Default Job < 1 sec
org.eclipse.core.runtime.AssertionFailedException: assertion failed: Search for method declaration did not find original element: String getFoo() [in A [in A.groovy [in p [in src [in TestProject]]]]]
	at org.codehaus.groovy.eclipse.refactoring.test.rename.RenameMethodTests.runTest(RenameMethodTests.groovy:55)
	at org.codehaus.groovy.eclipse.refactoring.test.rename.RenameMethodTests.runTest(RenameMethodTests.groovy)
	at org.codehaus.groovy.eclipse.refactoring.test.rename.RenameMethodTests.testEnumOverrides2(RenameMethodTests.groovy:141)
Collapse Failed RenameMethodTests testStaticImport History
Default Job 1 sec
org.junit.ComparisonFailure: invalid renaming expected:<...port static o.Other.[BAR

FOO
BAR()
o.Other.FOO
o.Other.BAR]()
> but was:<...port static o.Other.[FOO

(22 more lines...)
Collapse Failed RenameMethodTests testInitializer3 History
Default Job < 1 sec
org.eclipse.core.runtime.AssertionFailedException: assertion failed: Search for method declaration did not find original element: java.lang.Object m() [in A [in A.groovy [in p [in src [in TestProject]]]]]
	at org.codehaus.groovy.eclipse.refactoring.test.rename.RenameMethodTests.runTest(RenameMethodTests.groovy:55)
	at org.codehaus.groovy.eclipse.refactoring.test.rename.RenameMethodTests.runTest(RenameMethodTests.groovy)
	at org.codehaus.groovy.eclipse.refactoring.test.rename.RenameMethodTests.testInitializer3(RenameMethodTests.groovy:162)
Collapse Failed RenameMethodTests test4 History
Default Job < 1 sec
org.eclipse.core.runtime.AssertionFailedException: assertion failed: Search for method declaration did not find original element: void m() [in A [in A.groovy [in p [in src [in TestProject]]]]]
	at org.codehaus.groovy.eclipse.refactoring.test.rename.RenameMethodTests.runTest(RenameMethodTests.groovy:55)
	at org.codehaus.groovy.eclipse.refactoring.test.rename.RenameMethodTests.runTest(RenameMethodTests.groovy)
	at org.codehaus.groovy.eclipse.refactoring.test.rename.RenameMethodTests.test4(RenameMethodTests.groovy:90)
Collapse Failed RenameMethodTests test5 History
Default Job < 1 sec
org.eclipse.core.runtime.AssertionFailedException: assertion failed: Search for method declaration did not find original element: java.lang.Object m() [in A [in A.groovy [in p [in src [in TestProject]]]]]
	at org.codehaus.groovy.eclipse.refactoring.test.rename.RenameMethodTests.runTest(RenameMethodTests.groovy:55)
	at org.codehaus.groovy.eclipse.refactoring.test.rename.RenameMethodTests.runTest(RenameMethodTests.groovy)
	at org.codehaus.groovy.eclipse.refactoring.test.rename.RenameMethodTests.test5(RenameMethodTests.groovy:95)
Collapse Failed RenameMethodTests test2 History
Default Job < 1 sec
org.eclipse.core.runtime.AssertionFailedException: assertion failed: Search for method declaration did not find original element: void m() [in A [in A.groovy [in p [in src [in TestProject]]]]]
	at org.codehaus.groovy.eclipse.refactoring.test.rename.RenameMethodTests.runTest(RenameMethodTests.groovy:55)
	at org.codehaus.groovy.eclipse.refactoring.test.rename.RenameMethodTests.runTest(RenameMethodTests.groovy)
	at org.codehaus.groovy.eclipse.refactoring.test.rename.RenameMethodTests.test2(RenameMethodTests.groovy:80)
Collapse Failed RenameMethodTests test3 History
Default Job 1 sec
org.junit.ComparisonFailure: invalid renaming expected:<...      m
            [k()
            this.m
            this.k()
            new A().m
            new A().k()
            def x = new A()
            x.m
(38 more lines...)
Collapse Failed RenameMethodTests testEnumOverrides History
Default Job < 1 sec
org.eclipse.core.runtime.AssertionFailedException: assertion failed: Search for method declaration did not find original element: String getFoo() [in A [in A.groovy [in p [in src [in TestProject]]]]]
	at org.codehaus.groovy.eclipse.refactoring.test.rename.RenameMethodTests.runTest(RenameMethodTests.groovy:55)
	at org.codehaus.groovy.eclipse.refactoring.test.rename.RenameMethodTests.runTest(RenameMethodTests.groovy)
	at org.codehaus.groovy.eclipse.refactoring.test.rename.RenameMethodTests.testEnumOverrides(RenameMethodTests.groovy:135)
Collapse Failed RenameMethodTests test8 History
Default Job < 1 sec
org.eclipse.core.runtime.AssertionFailedException: assertion failed: Search for method declaration did not find original element: java.lang.Object m() [in B [in A.groovy [in p [in src [in TestProject]]]]]
	at org.codehaus.groovy.eclipse.refactoring.test.rename.RenameMethodTests.runTest(RenameMethodTests.groovy:55)
	at org.codehaus.groovy.eclipse.refactoring.test.rename.RenameMethodTests.runTest(RenameMethodTests.groovy)
	at org.codehaus.groovy.eclipse.refactoring.test.rename.RenameMethodTests.test8(RenameMethodTests.groovy:110)
Collapse Failed RenameMethodTests test9 History
Default Job < 1 sec
org.eclipse.core.runtime.AssertionFailedException: assertion failed: Search for method declaration did not find original element: java.lang.Object m() [in A [in A.groovy [in p [in src [in TestProject]]]]]
	at org.codehaus.groovy.eclipse.refactoring.test.rename.RenameMethodTests.runTest(RenameMethodTests.groovy:55)
	at org.codehaus.groovy.eclipse.refactoring.test.rename.RenameMethodTests.runTest(RenameMethodTests.groovy)
	at org.codehaus.groovy.eclipse.refactoring.test.rename.RenameMethodTests.test9(RenameMethodTests.groovy:115)
Collapse Failed RenameMethodTests test6 History
Default Job < 1 sec
org.eclipse.core.runtime.AssertionFailedException: assertion failed: Search for method declaration did not find original element: java.lang.Object m() [in A [in A.groovy [in p [in src [in TestProject]]]]]
	at org.codehaus.groovy.eclipse.refactoring.test.rename.RenameMethodTests.runTest(RenameMethodTests.groovy:55)
	at org.codehaus.groovy.eclipse.refactoring.test.rename.RenameMethodTests.runTest(RenameMethodTests.groovy)
	at org.codehaus.groovy.eclipse.refactoring.test.rename.RenameMethodTests.test6(RenameMethodTests.groovy:100)
Collapse Failed RenameMethodTests testAnonOverrides History
Default Job 4 secs
org.eclipse.core.runtime.AssertionFailedException: assertion failed: Search for method declaration did not find original element: int run() [in I [in A.groovy [in p [in src [in TestProject]]]]]
	at org.codehaus.groovy.eclipse.refactoring.test.rename.RenameMethodTests.runTest(RenameMethodTests.groovy:55)
	at org.codehaus.groovy.eclipse.refactoring.test.rename.RenameMethodTests.runTest(RenameMethodTests.groovy)
	at org.codehaus.groovy.eclipse.refactoring.test.rename.RenameMethodTests.testAnonOverrides(RenameMethodTests.groovy:129)
Collapse Failed RenameMethodTests test7 History
Default Job < 1 sec
org.eclipse.core.runtime.AssertionFailedException: assertion failed: Search for method declaration did not find original element: java.lang.Object m() [in A [in A.groovy [in p [in src [in TestProject]]]]]
	at org.codehaus.groovy.eclipse.refactoring.test.rename.RenameMethodTests.runTest(RenameMethodTests.groovy:55)
	at org.codehaus.groovy.eclipse.refactoring.test.rename.RenameMethodTests.runTest(RenameMethodTests.groovy)
	at org.codehaus.groovy.eclipse.refactoring.test.rename.RenameMethodTests.test7(RenameMethodTests.groovy:105)
Collapse Failed RenameMethodTests test1 History
Default Job 1 sec
org.junit.ComparisonFailure: invalid renaming expected:<...(){
 }
 void f(){
  [k();
 }
 static int fred(){
  k();
  return 1;
(142 more lines...)
Collapse Failed RenameMethodTests testOverload3 History
Default Job < 1 sec
org.eclipse.core.runtime.AssertionFailedException: assertion failed: Search for method declaration did not find original element: java.lang.Object m(java.lang.Object) [in I1 [in A.groovy [in p [in src [in TestProject]]]]]
	at org.codehaus.groovy.eclipse.refactoring.test.rename.RenameMethodTests.runTest(RenameMethodTests.groovy:55)
	at org.codehaus.groovy.eclipse.refactoring.test.rename.RenameMethodTests.runTest(RenameMethodTests.groovy)
	at org.codehaus.groovy.eclipse.refactoring.test.rename.RenameMethodTests.testOverload3(RenameMethodTests.groovy:191)
Collapse Failed RenameMethodTests testOverload2 History
Default Job < 1 sec
org.eclipse.core.runtime.AssertionFailedException: assertion failed: Search for method declaration did not find original element: java.lang.Object m(java.lang.Object) [in I2 [in A.groovy [in p [in src [in TestProject]]]]]
	at org.codehaus.groovy.eclipse.refactoring.test.rename.RenameMethodTests.runTest(RenameMethodTests.groovy:55)
	at org.codehaus.groovy.eclipse.refactoring.test.rename.RenameMethodTests.runTest(RenameMethodTests.groovy)
	at org.codehaus.groovy.eclipse.refactoring.test.rename.RenameMethodTests.testOverload2(RenameMethodTests.groovy:186)
Collapse Failed RenameMethodTests testOverload1 History
Default Job < 1 sec
org.eclipse.core.runtime.AssertionFailedException: assertion failed: Search for method declaration did not find original element: java.lang.Object m(java.lang.Object) [in I1 [in A.groovy [in p [in src [in TestProject]]]]]
	at org.codehaus.groovy.eclipse.refactoring.test.rename.RenameMethodTests.runTest(RenameMethodTests.groovy:55)
	at org.codehaus.groovy.eclipse.refactoring.test.rename.RenameMethodTests.runTest(RenameMethodTests.groovy)
	at org.codehaus.groovy.eclipse.refactoring.test.rename.RenameMethodTests.testOverload1(RenameMethodTests.groovy:181)
Collapse Failed RenameMethodTests testInitializer1 History
Default Job < 1 sec
org.eclipse.core.runtime.AssertionFailedException: assertion failed: Search for method declaration did not find original element: java.lang.Object m() [in A [in A.groovy [in p [in src [in TestProject]]]]]
	at org.codehaus.groovy.eclipse.refactoring.test.rename.RenameMethodTests.runTest(RenameMethodTests.groovy:55)
	at org.codehaus.groovy.eclipse.refactoring.test.rename.RenameMethodTests.runTest(RenameMethodTests.groovy)
	at org.codehaus.groovy.eclipse.refactoring.test.rename.RenameMethodTests.testInitializer1(RenameMethodTests.groovy:152)
Collapse Failed RenameMethodTests testInitializer2 History
Default Job < 1 sec
org.eclipse.core.runtime.AssertionFailedException: assertion failed: Search for method declaration did not find original element: java.lang.Object m() [in A [in A.groovy [in p [in src [in TestProject]]]]]
	at org.codehaus.groovy.eclipse.refactoring.test.rename.RenameMethodTests.runTest(RenameMethodTests.groovy:55)
	at org.codehaus.groovy.eclipse.refactoring.test.rename.RenameMethodTests.runTest(RenameMethodTests.groovy)
	at org.codehaus.groovy.eclipse.refactoring.test.rename.RenameMethodTests.testInitializer2(RenameMethodTests.groovy:157)
Collapse Failed BasicGroovyBuildTests testBuildGroovyHelloWorld History
Default Job < 1 sec
org.junit.ComparisonFailure: unexpected recompiled units. lenExpected=1 lenActual=2 expected:<{p1.Hello[]}> but was:<{p1.Hello[,p1.Hello]}>
	at org.eclipse.jdt.core.groovy.tests.builder.BasicGroovyBuildTests.testBuildGroovyHelloWorld(BasicGroovyBuildTests.java:195)
Collapse Failed ConstructorReferenceSearchTests testConstructorReferences1 History
Default Job < 1 sec
java.lang.AssertionError: Incorrect number of matches; expected:<3> but was:<0>
	at org.eclipse.jdt.core.groovy.tests.search.ConstructorReferenceSearchTests.testConstructorReferences1(ConstructorReferenceSearchTests.java:59)
Collapse Failed ConstructorReferenceSearchTests testNewifyConstructorReferences1 History
Default Job < 1 sec
java.lang.AssertionError: expected:<2> but was:<0>
	at org.eclipse.jdt.core.groovy.tests.search.ConstructorReferenceSearchTests.testNewifyConstructorReferences1(ConstructorReferenceSearchTests.java:387)
Collapse Failed ConstructorReferenceSearchTests testConstructorReferences11 History
Default Job < 1 sec
java.lang.AssertionError: expected:<2> but was:<0>
	at org.eclipse.jdt.core.groovy.tests.search.ConstructorReferenceSearchTests.testConstructorReferences11(ConstructorReferenceSearchTests.java:276)
Collapse Failed ConstructorReferenceSearchTests testConstructorReferences8 History
Default Job < 1 sec
java.lang.AssertionError: expected:<1> but was:<0>
	at org.eclipse.jdt.core.groovy.tests.search.ConstructorReferenceSearchTests.testConstructorReferences8(ConstructorReferenceSearchTests.java:218)
Collapse Failed DGMInferencingTests testDGM22 History
Default Job < 1 sec
java.lang.AssertionError: Expected type not found.
Expected: java.lang.Integer
Found: java.lang.Object
Declaring type: groovy.lang.Closure<V extends java.lang.Object>
ASTNode: org.codehaus.groovy.ast.expr.VariableExpression@ecbe3[variable: it]
Confidence: INFERRED

java.lang.AssertionError: 
(9 more lines...)
Collapse Failed DGMInferencingTests testDGMClosure16 History
Default Job < 1 sec
java.lang.AssertionError: Expected type not found.
Expected: java.util.Date
Found: java.lang.Object
Declaring type: Search
ASTNode: org.codehaus.groovy.ast.expr.VariableExpression@f0f88[variable: val]
Confidence: INFERRED

java.lang.AssertionError: 
(9 more lines...)
Existing test failures 1
Status Test Failing since View job Duration
junit.framework.ComparisonFailure: 
----------- Expected ------------

------------ but was ------------
Problem : The import util.MyException is never used [ resource : </Project/src/p/Test.java> range : <18,34> category : <120> severity : <1>]

--------- Difference is ----------
 expected:<[]> but was:<[Problem : The import util.MyException is never used [ resource : </Project/src/p/Test.java> range : <18,34> category : <120> severity : <1>]
(12 more lines...)
Fixed tests 1
Status Test Failing since View job Duration
Successful BasicGroovyBuildTests testBuildGroovyHelloWorld2 History
Failing since build #460 (Changes by Eric Milles) Default Job < 1 sec

Jira issues

IssueDescriptionStatus
Unknown Issue TypeGROOVY-6148Could not obtain issue details from Jira