Build: #462 failed Changes by Eric Milles

Build result summary

Details

Completed
Duration
91 minutes
Labels
None
Agent
bamboo-22.af.pivotal.io
Revision
b551656bad2833ee89b5f8a12cf281f4a39b5068 b551656bad2833ee89b5f8a12cf281f4a39b5068
Total tests
6050
Failing since
#448 (Changes by Eric Milles)

Responsible

Code commits

Author Commit Message Commit date
Eric Milles Eric Milles b551656bad2833ee89b5f8a12cf281f4a39b5068 b551656bad2833ee89b5f8a12cf281f4a39b5068 exclude anon. inner types
Eric Milles Eric Milles b86f34a41d695e27ab981e1fc0cba4dbbcc533d0 b86f34a41d695e27ab981e1fc0cba4dbbcc533d0 added tests

Tests

New test failures 2
Status Test View job Duration
Collapse Failed DGMInferencingTests testDGM19 History
Default Job < 1 sec
java.lang.AssertionError: Expected type not found.
Expected: java.lang.Integer
Found: java.lang.Object
Declaring type: Search
ASTNode: org.codehaus.groovy.ast.expr.VariableExpression@f532e[variable: value]
Confidence: INFERRED

java.lang.AssertionError: 
(9 more lines...)
Collapse Failed DGMInferencingTests testDGM7 History
Default Job < 1 sec
java.lang.AssertionError: Expected type not found.
Expected: java.lang.String
Found: java.lang.Object
Declaring type: Search
ASTNode: org.codehaus.groovy.ast.expr.VariableExpression@f0080[variable: key]
Confidence: INFERRED

java.lang.AssertionError: 
(9 more lines...)
Existing test failures 1
Status Test Failing since View job Duration
junit.framework.ComparisonFailure: 
----------- Expected ------------

------------ but was ------------
Problem : The import util.MyException is never used [ resource : </Project/src/p/Test.java> range : <18,34> category : <120> severity : <1>]

--------- Difference is ----------
 expected:<[]> but was:<[Problem : The import util.MyException is never used [ resource : </Project/src/p/Test.java> range : <18,34> category : <120> severity : <1>]
(12 more lines...)
Fixed tests 43
Status Test Failing since View job Duration
Successful RenameFieldTests test10 History
Failing since build #461 (Changes by Eric Milles) Default Job 5 secs
Successful RenameFieldTests test11 History
Failing since build #461 (Changes by Eric Milles) Default Job 1 sec
Successful RenameFieldTests testInitializer3 History
Failing since build #461 (Changes by Eric Milles) Default Job 1 sec
Successful RenameFieldTests test14 History
Failing since build #461 (Changes by Eric Milles) Default Job 1 sec
Successful RenameFieldTests test13 History
Failing since build #461 (Changes by Eric Milles) Default Job 1 sec
Successful RenameFieldTests testInitializer2 History
Failing since build #461 (Changes by Eric Milles) Default Job 1 sec
Successful RenameFieldTests testInitializer1 History
Failing since build #461 (Changes by Eric Milles) Default Job 1 sec
Successful RenameFieldTests test9 History
Failing since build #461 (Changes by Eric Milles) Default Job 1 sec
Successful RenameFieldTests test7 History
Failing since build #461 (Changes by Eric Milles) Default Job 1 sec
Successful RenameFieldTests test8 History
Failing since build #461 (Changes by Eric Milles) Default Job 1 sec
Successful RenameFieldTests test2 History
Failing since build #461 (Changes by Eric Milles) Default Job 1 sec
Successful RenameFieldTests test5 History
Failing since build #461 (Changes by Eric Milles) Default Job 1 sec
Successful RenameFieldTests test6 History
Failing since build #461 (Changes by Eric Milles) Default Job 1 sec
Successful RenameFieldTests test3 History
Failing since build #461 (Changes by Eric Milles) Default Job 1 sec
Successful RenameFieldTests test4 History
Failing since build #461 (Changes by Eric Milles) Default Job 1 sec
Successful RenameFieldTests testScript2 History
Failing since build #461 (Changes by Eric Milles) Default Job 1 sec
Successful RenameFieldTests testScript1 History
Failing since build #461 (Changes by Eric Milles) Default Job 1 sec
Successful RenameMethodTests testInitializer2 History
Failing since build #461 (Changes by Eric Milles) Default Job 1 sec
Successful RenameMethodTests testInitializer3 History
Failing since build #461 (Changes by Eric Milles) Default Job 1 sec
Successful RenameMethodTests testInitializer1 History
Failing since build #461 (Changes by Eric Milles) Default Job 1 sec
Successful RenameMethodTests testStaticImport History
Failing since build #461 (Changes by Eric Milles) Default Job 1 sec
Successful RenameMethodTests testEnumOverrides History
Failing since build #461 (Changes by Eric Milles) Default Job 1 sec
Successful RenameMethodTests testEnumOverrides2 History
Failing since build #461 (Changes by Eric Milles) Default Job 1 sec
Successful RenameMethodTests testAnonOverrides History
Failing since build #461 (Changes by Eric Milles) Default Job 10 secs
Successful RenameMethodTests testOverload3 History
Failing since build #461 (Changes by Eric Milles) Default Job 1 sec
Successful RenameMethodTests testOverload2 History
Failing since build #461 (Changes by Eric Milles) Default Job 2 secs
Successful RenameMethodTests testOverload1 History
Failing since build #461 (Changes by Eric Milles) Default Job 2 secs
Successful RenameMethodTests test4 History
Failing since build #461 (Changes by Eric Milles) Default Job 1 sec
Successful RenameMethodTests test5 History
Failing since build #461 (Changes by Eric Milles) Default Job 1 sec
Successful RenameMethodTests test2 History
Failing since build #461 (Changes by Eric Milles) Default Job 1 sec
Successful RenameMethodTests test3 History
Failing since build #461 (Changes by Eric Milles) Default Job 1 sec
Successful RenameMethodTests test8 History
Failing since build #461 (Changes by Eric Milles) Default Job 1 sec
Successful RenameMethodTests test9 History
Failing since build #461 (Changes by Eric Milles) Default Job 1 sec
Successful RenameMethodTests test6 History
Failing since build #461 (Changes by Eric Milles) Default Job 1 sec
Successful RenameMethodTests test7 History
Failing since build #461 (Changes by Eric Milles) Default Job 1 sec
Successful RenameMethodTests test1 History
Failing since build #461 (Changes by Eric Milles) Default Job 1 sec
Successful BasicGroovyBuildTests testBuildGroovyHelloWorld History
Failing since build #461 (Changes by Eric Milles) Default Job < 1 sec
Successful ConstructorReferenceSearchTests testConstructorReferences11 History
Failing since build #461 (Changes by Eric Milles) Default Job < 1 sec
Successful ConstructorReferenceSearchTests testConstructorReferences8 History
Failing since build #461 (Changes by Eric Milles) Default Job < 1 sec
Successful ConstructorReferenceSearchTests testConstructorReferences1 History
Failing since build #461 (Changes by Eric Milles) Default Job < 1 sec
Successful ConstructorReferenceSearchTests testNewifyConstructorReferences1 History
Failing since build #461 (Changes by Eric Milles) Default Job < 1 sec
Successful DGMInferencingTests testDGMClosure16 History
Failing since build #461 (Changes by Eric Milles) Default Job < 1 sec
Successful DGMInferencingTests testDGM22 History
Failing since build #461 (Changes by Eric Milles) Default Job < 1 sec