Build: #463 failed Changes by Eric Milles

Build result summary

Details

Completed
Duration
92 minutes
Labels
None
Agent
bamboo-20.af.pivotal.io
Revision
c0610972bb06733a2529aa9c35c8715a716d9891 c0610972bb06733a2529aa9c35c8715a716d9891
Total tests
6057
Failing since
#448 (Changes by Eric Milles)

Responsible

Code commits

Author Commit Message Commit date
Eric Milles Eric Milles c0610972bb06733a2529aa9c35c8715a716d9891 c0610972bb06733a2529aa9c35c8715a716d9891 reduce conflicts and compilation

Tests

New test failures 2
Status Test View job Duration
Collapse Failed BasicGroovyBuildTests testNoDoubleResolve History
Default Job < 1 sec
java.lang.AssertionError
	at org.eclipse.jdt.core.groovy.tests.builder.BasicGroovyBuildTests.testNoDoubleResolve(BasicGroovyBuildTests.java:2726)
Collapse Failed Groovy20InferencingTests testCompileStatic13 History
Default Job < 1 sec
java.lang.AssertionError: Expected type not found.
Expected: java.lang.Number
Found: java.lang.String
Declaring type: X
ASTNode: org.codehaus.groovy.ast.expr.ConstantExpression@11125f[readOnly]
Confidence: UNKNOWN

java.lang.AssertionError: 
(8 more lines...)
Existing test failures 1
Status Test Failing since View job Duration
junit.framework.ComparisonFailure: 
----------- Expected ------------

------------ but was ------------
Problem : The import util.MyException is never used [ resource : </Project/src/p/Test.java> range : <18,34> category : <120> severity : <1>]

--------- Difference is ----------
 expected:<[]> but was:<[Problem : The import util.MyException is never used [ resource : </Project/src/p/Test.java> range : <18,34> category : <120> severity : <1>]
(12 more lines...)
Fixed tests 2
Status Test Failing since View job Duration
Successful DGMInferencingTests testDGM7 History
Failing since build #462 (Changes by Eric Milles) Default Job < 1 sec
Successful DGMInferencingTests testDGM19 History
Failing since build #462 (Changes by Eric Milles) Default Job < 1 sec