Build: #464 failed Changes by Eric Milles

Build result summary

Details

Completed
Duration
92 minutes
Labels
None
Agent
bamboo-19.af.pivotal.io
Revision
0d9acf8eea0242501ca4e62dcab522741a685575 0d9acf8eea0242501ca4e62dcab522741a685575
Total tests
6057
Failing since
#448 (Changes by Eric Milles)

Responsible

Code commits

Author Commit Message Commit date
Eric Milles Eric Milles 0d9acf8eea0242501ca4e62dcab522741a685575 0d9acf8eea0242501ca4e62dcab522741a685575 Fix for #970: reverse equals to avoid NPE

Tests

New test failures 49
Status Test View job Duration
Collapse Failed RenameFieldTests test3 History
Default Job 1 sec
org.junit.ComparisonFailure: invalid renaming expected:<... void s() {
        [g = g
        this.g = super.g
    }
}

class A extends C {
    def g = 7
(59 more lines...)
Collapse Failed RenameFieldTests test4 History
Default Job 1 sec
org.junit.ComparisonFailure: invalid renaming expected:<...     this.f = super.[g]
    }
}

class A {
...> but was:<...     this.f = super.[f]
    }
}
(19 more lines...)
Collapse Failed RenameFieldTests test6 History
Default Job 1 sec
org.junit.ComparisonFailure: invalid renaming expected:<... {
        f = this.[g]
    }
}> but was:<... {
        f = this.[f]
    }
}>
org.junit.ComparisonFailure: 
(11 more lines...)
Collapse Failed RenameFieldTests test5 History
Default Job 1 sec
org.junit.ComparisonFailure: invalid renaming expected:<...s A {
    {
        [g = g
        while (true) {
            def f = this.g
            f++
        }
        g]++
(34 more lines...)
Collapse Failed RenameFieldTests test11 History
Default Job 1 sec
org.junit.ComparisonFailure: invalid renaming expected:<...port static o.Other.[BAR

BAR
o.Other.BAR]> but was:<...port static o.Other.[FOO

FOO
o.Other.FOO]>
org.junit.ComparisonFailure: 
(9 more lines...)
Collapse Failed RenameFieldTests test10 History
Default Job 5 secs
org.junit.ComparisonFailure: invalid renaming expected:<...ef s() {
        "${[g}"
        "${this.g]}"
    }
}> but was:<...ef s() {
        "${[f}"
        "${this.f]}"
    }
(15 more lines...)
Collapse Failed RenameFieldTests test13 History
Default Job 1 sec
org.junit.ComparisonFailure: invalid renaming expected:<...2 = new MyBean(foo: [g].foo)
 }
}> but was:<...2 = new MyBean(foo: [f].foo)
 }
}>
org.junit.ComparisonFailure: 
invalid renaming expected:<...2 = new MyBean(foo: [g].foo)
	}
(5 more lines...)
Collapse Failed RenameFieldTests test14 History
Default Job 1 sec
org.junit.ComparisonFailure: invalid renaming expected:<...tBar(Class bar) {
  [baz = bar
 }
}

@CompileStatic
class A {
 def f = new MyBean()
(41 more lines...)
Collapse Failed RenameFieldTests testInitializer1 History
Default Job 1 sec
org.junit.ComparisonFailure: invalid renaming expected:<... p
class A { 
    { [g }
    def g
    def other = g
    def doOperation= { g }
    { g] }
}> but was:<... p
(27 more lines...)
Collapse Failed RenameFieldTests testInitializer2 History
Default Job 1 sec
org.junit.ComparisonFailure: invalid renaming expected:<... 
    A() { }
    { [g }
    def g
    def other = g
    def doOperation= { g }
    { g] }
}> but was:<... 
(27 more lines...)
Collapse Failed RenameFieldTests testInitializer3 History
Default Job 1 sec
org.junit.ComparisonFailure: invalid renaming expected:<...   A(a,b) { }
    { [g }
    def g
    def other = g
    def doOperation= { g }
    { g] }
}> but was:<...   A(a,b) { }
    { [f }
(23 more lines...)
Collapse Failed RenameFieldTests testScript2 History
Default Job 1 sec
org.junit.ComparisonFailure: invalid renaming expected:<...f val = new C()
val.[g

def val2 = ""
val2.f
val2 = val
val2.g]

(34 more lines...)
Collapse Failed RenameFieldTests testScript1 History
Default Job 1 sec
org.junit.ComparisonFailure: invalid renaming expected:<...f val = new B()
val.[g

def val2 = ""
val2.f
val2 = val
val2.g]

(42 more lines...)
Collapse Failed RenameFieldTests test9 History
Default Job 1 sec
org.junit.ComparisonFailure: invalid renaming expected:<...c def s() {
        [g = A.g
    }
}

class B extends A {
    public def f
    void m() {
(59 more lines...)
Collapse Failed RenameFieldTests test7 History
Default Job 1 sec
org.junit.ComparisonFailure: invalid renaming expected:<...->
        f = this.[g]
    }
}> but was:<...->
        f = this.[f]
    }
}>
org.junit.ComparisonFailure: 
(10 more lines...)
Collapse Failed RenameFieldTests test8 History
Default Job 1 sec
org.junit.ComparisonFailure: invalid renaming expected:<...s() {
        f = A.[g
        f = super.g
    }
}

class A extends C {
    static g = 7
(63 more lines...)
Collapse Failed RenameFieldTests test2 History
Default Job 1 sec
org.junit.ComparisonFailure: invalid renaming expected:<...oid s() {
        c.[g = 3
        def f =  {f -> println(f)}
        c.g()
    }
}

class A {
(51 more lines...)
Collapse Failed RenameTypeTests testGenerics4 History
Default Job 1 sec
org.junit.ComparisonFailure: invalid renaming expected:<...    Class<? extends [B> class1= this.getClass();
    Class<? extends B> class2= B.class;
    Class<B> class3= (Class<B>) this.getClass();
    X<B> getX() {
        X<B> x= new X<B>();
        x.t= (new ArrayList<B>() as B[]);
        return x;
    }
(51 more lines...)
Collapse Failed RenameTypeTests testInner3 History
Default Job 1 sec
org.junit.ComparisonFailure: expected:<...n.*
import static p.[Wrapper.Inner.*
import p.OuterAgain.InnerAgain
import p.Wrapper.Inner
import p.OuterAgain.*
import p.Wrapper.*

val = OuterAgain.InnerAgain.thing
(36 more lines...)
Collapse Failed RenameTypeTests testAlias1 History
Default Job 1 sec
org.junit.ComparisonFailure: invalid renaming in p2.A expected:<...ckage p2;

import p.[B] as Other;

class C ...> but was:<...ckage p2;

import p.[A] as Other;

(12 more lines...)
Collapse Failed RenameTypeTests testGenerics5 History
Default Job 1 sec
org.junit.ComparisonFailure: expected:<...p

class C {
  List<[B> list1
  List<? super B> list2
  List<? extends B> list3
  List<Collection<B>> list4

(36 more lines...)
Collapse Failed RenameTypeTests testJavadoc1 History
Default Job 1 sec
org.junit.ComparisonFailure: invalid renaming expected:<package p;
/**
 * [B
 */
class B{ }

class Other {
    def x = {
(37 more lines...)
Collapse Failed RenameTypeTests testAnnotation2 History
Default Job 1 sec
org.junit.ComparisonFailure: invalid renaming expected:<...interface Main {
   [B child() default @B("Void");
}

@Main(child=@/*test*/B(""))
@B("")
class Client {
    @Deprecated
(47 more lines...)
Collapse Failed RenameTypeTests testAnnotation3 History
Default Job 1 sec
org.junit.ComparisonFailure: invalid renaming expected:<... default "NULL";
}
@[B("")
class Test {
    
    @B("A and p.Test.A and p.A and q.Test.A")
    void test () {
        ArrayList<String> list= new ArrayList<String>() {
(39 more lines...)
Collapse Failed RenameTypeTests testAnnotation1 History
Default Job 1 sec
org.junit.ComparisonFailure: invalid renaming expected:<...
@interface B { }

@[B
class Client {
    @Deprecated @B]() void bad() { }
}> but was:<...
@interface B { }
(23 more lines...)
Collapse Failed RenameTypeTests test13 History
Default Job 1 sec
org.junit.ComparisonFailure: invalid renaming expected:<...lic class B {
    B([B a){}
    B a(B a){
        a= new B(new B](a));
        return...> but was:<...lic class B {
    B([A a){}
    A a(A a){
        a= new A(new A](a));
(15 more lines...)
Collapse Failed RenameTypeTests test12 History
Default Job 1 sec
org.junit.ComparisonFailure: invalid renaming expected:<...  def x() {
        [B]
    }
}> but was:<...  def x() {
        [A]
    }
}>
org.junit.ComparisonFailure: 
(11 more lines...)
Collapse Failed RenameTypeTests test11 History
Default Job 1 sec
org.junit.ComparisonFailure: invalid renaming expected:<...tatic x() {
        [B]
    }
}> but was:<...tatic x() {
        [A]
    }
}>
org.junit.ComparisonFailure: 
(11 more lines...)
Collapse Failed RenameTypeTests test10 History
Default Job 1 sec
org.junit.ComparisonFailure: invalid renaming expected:<...her {
    def x = { [B] a ->
              ...> but was:<...her {
    def x = { [A] a ->
              ...>
org.junit.ComparisonFailure: 
invalid renaming expected:<...her {
    def x = { [B] a ->
(7 more lines...)
Collapse Failed RenameTypeTests test9 History
Default Job 1 sec
org.junit.ComparisonFailure: invalid renaming expected:<...f x = {
            [B a = new B]()
    }
}> but was:<...f x = {
            [A a = new A]()
    }
}>
org.junit.ComparisonFailure: 
(11 more lines...)
Collapse Failed RenameTypeTests test3 History
Default Job 1 sec
org.junit.ComparisonFailure: invalid renaming expected:<...erface B{
   void m([B a);
}

class Sub implements B {
    void m(B] a){}
}> but was:<...erface B{
   void m([A a);
(23 more lines...)
Collapse Failed RenameTypeTests test4 History
Default Job 1 sec
org.junit.ComparisonFailure: invalid renaming expected:<...kage p;
class B{
   [B] m(a) {}
}> but was:<...kage p;
class B{
   [A] m(a) {}
}>
org.junit.ComparisonFailure: 
(11 more lines...)
Collapse Failed RenameTypeTests test1 History
Default Job 1 sec
org.junit.ComparisonFailure: invalid renaming expected:<...
class B{
   void m([B] a){};
}> but was:<...
class B{
   void m([A] a){};
}>
org.junit.ComparisonFailure: 
(11 more lines...)
Collapse Failed RenameTypeTests test2 History
Default Job 1 sec
org.junit.ComparisonFailure: invalid renaming expected:<...
class B{
   void m([B a){};
}

class Sub extends B {
    void m(B] a){}
}> but was:<...
(27 more lines...)
Collapse Failed RenameTypeTests test7 History
Default Job 1 sec
org.junit.ComparisonFailure: invalid renaming expected:<...

class Other {
    [B x() {
        def x = {
                B a = new B]()
        }
    }
(31 more lines...)
Collapse Failed RenameTypeTests test8 History
Default Job 1 sec
org.junit.ComparisonFailure: invalid renaming expected:<...

class Other {
    [B x() {
        def x = { B] a ->
              ...> but was:<...

class Other {
(19 more lines...)
Collapse Failed RenameTypeTests test5 History
Default Job 1 sec
org.junit.ComparisonFailure: invalid renaming expected:<...  def x() {
        [B x = new B]()
    }
}> but was:<...  def x() {
        [A x = new A]()
    }
}>
org.junit.ComparisonFailure: 
(11 more lines...)
Collapse Failed RenameTypeTests test6 History
Default Job 1 sec
org.junit.ComparisonFailure: invalid renaming expected:<...

class Other {
    [B x = new B]()
}> but was:<...

class Other {
    [A x = new A]()
(15 more lines...)
Collapse Failed RenameTypeTests testEnum1 History
Default Job 1 sec
org.junit.ComparisonFailure: invalid renaming in p2.A expected:<...ckage p2;

import p.[B;

class C {
    p.B a= p.B.ONE;
    p.B b= p.B].ONE;
    C a2= new ...> but was:<...ckage p2;
(24 more lines...)
Collapse Failed RenameTypeTests testEnum2 History
Default Job 1 sec
org.junit.ComparisonFailure: invalid renaming expected:<...ONE ,
    BIG ;
    [B longerNameThan(B] a) { a }
}
> but was:<...ONE ,
    BIG ;
    [A longerNameThan(A] a) { a }
}
(15 more lines...)
Collapse Failed RenameTypeTests testInner1 History
Default Job 1 sec
org.junit.ComparisonFailure: invalid renaming expected:<...e p

import p.Outer.[B
import p.Outer.AZ

class Outer {
  class B {
  }
(85 more lines...)
Collapse Failed RenameTypeTests testInner2 History
Default Job 1 sec
org.junit.ComparisonFailure: invalid renaming expected:<...n.*
import static p.[Wrapper.Inner.*
import p.OuterAgain.InnerAgain
import p.Wrapper.Inner
import p.OuterAgain.*
import p.Wrapper.*

class Wrapper {
(85 more lines...)
Collapse Failed RenameTypeTests testGenerics1 History
Default Job 1 sec
org.junit.ComparisonFailure: invalid renaming expected:<...X x) {}

    void m([B a) {
        new B<T>();
        new B<T>(null, "y");
    };
}

(59 more lines...)
Collapse Failed RenameTypeTests testGenerics2 History
Default Job 1 sec
org.junit.ComparisonFailure: invalid renaming expected:<...A> {
    A a;
    p.[B pa= new p.B]();
}
> but was:<...A> {
    A a;
    p.[A pa= new p.A]();
}
(15 more lines...)
Collapse Failed RenameTypeTests testGenerics3 History
Default Job 1 sec
org.junit.ComparisonFailure: invalid renaming expected:<...  ArrayList<? super [B> fSink;
}

class U extends ArrayList<B> {
    public boolean add(B arg0) {
        return false;
    }
}
(35 more lines...)
Collapse Failed BinarySearchTests testClassDecl1 History
Default Job 1 sec
java.lang.AssertionError: Expecting 12 matches, but found 0

java.lang.AssertionError: 
Expecting 12 matches, but found 0

	at org.eclipse.jdt.core.groovy.tests.search.BinarySearchTests.assertMatches(BinarySearchTests.java:139)
	at org.eclipse.jdt.core.groovy.tests.search.BinarySearchTests.testClassDecl1(BinarySearchTests.java:165)
Collapse Failed BinarySearchTests testMethodDecl History
Default Job < 1 sec
java.lang.AssertionError: Expecting 4 matches, but found 0

java.lang.AssertionError: 
Expecting 4 matches, but found 0

	at org.eclipse.jdt.core.groovy.tests.search.BinarySearchTests.assertMatches(BinarySearchTests.java:139)
	at org.eclipse.jdt.core.groovy.tests.search.BinarySearchTests.testMethodDecl(BinarySearchTests.java:199)
Collapse Failed ConstructorReferenceSearchTests testConstructorReferences11a History
Default Job < 1 sec
java.lang.AssertionError: expected:<3> but was:<0>
	at org.eclipse.jdt.core.groovy.tests.search.ConstructorReferenceSearchTests.testConstructorReferences11a(ConstructorReferenceSearchTests.java:295)
Collapse Failed TypeReferenceSearchTests testFindClassDeclarationWithPattern History
Default Job < 1 sec
java.lang.AssertionError: Expected but not found: SongTests (not open) [in SongTests.groovy [in gtunes [in src [in Project]]]]
Expected but not found: ArtistTests (not open) [in ArtistTests.groovy [in gtunes [in src [in Project]]]]
Found but not expected: class ArtistTests [in ArtistTests.groovy [in src.gtunes [in <project root> [in Project]]]]
  java.lang.Object testSomething()
Found but not expected: class SongTests [in SongTests.groovy [in src.gtunes [in <project root> [in Project]]]]
  java.lang.Object testSomething()

java.lang.AssertionError: 
(9 more lines...)
Existing test failures 1
Status Test Failing since View job Duration
junit.framework.ComparisonFailure: 
----------- Expected ------------

------------ but was ------------
Problem : The import util.MyException is never used [ resource : </Project/src/p/Test.java> range : <18,34> category : <120> severity : <1>]

--------- Difference is ----------
 expected:<[]> but was:<[Problem : The import util.MyException is never used [ resource : </Project/src/p/Test.java> range : <18,34> category : <120> severity : <1>]
(12 more lines...)
Fixed tests 2
Status Test Failing since View job Duration
Successful BasicGroovyBuildTests testNoDoubleResolve History
Failing since build #463 (Changes by Eric Milles) Default Job < 1 sec
Successful Groovy20InferencingTests testCompileStatic13 History
Failing since build #463 (Changes by Eric Milles) Default Job < 1 sec