Build: #465 failed Changes by Eric Milles

Test results

  • 6,057 tests in total
  • 5 tests failed
  • 4 failures are new
  • 49 tests were fixed
  • 122 tests were quarantined / skipped
  • 87 minutes taken in total.
New test failures 4
Status Test View job Duration
Collapse Failed ConstructorReferenceSearchTests testConstructorReferences1 History
Default Job < 1 sec
java.lang.AssertionError: Incorrect number of matches; expected:<3> but was:<0>
	at org.eclipse.jdt.core.groovy.tests.search.ConstructorReferenceSearchTests.testConstructorReferences1(ConstructorReferenceSearchTests.java:59)
Collapse Failed ConstructorReferenceSearchTests testConstructorReferences2 History
Default Job < 1 sec
java.lang.AssertionError: Incorrect number of matches; expected:<1> but was:<0>
	at org.eclipse.jdt.core.groovy.tests.search.ConstructorReferenceSearchTests.testConstructorReferences2(ConstructorReferenceSearchTests.java:96)
Collapse Failed ConstructorReferenceSearchTests testConstructorReferences12 History
Default Job < 1 sec
java.lang.AssertionError: expected:<2> but was:<0>
	at org.eclipse.jdt.core.groovy.tests.search.ConstructorReferenceSearchTests.testConstructorReferences12(ConstructorReferenceSearchTests.java:313)
Collapse Failed ConstructorReferenceSearchTests testConstructorReferences10 History
Default Job < 1 sec
java.lang.AssertionError: expected:<1> but was:<0>
	at org.eclipse.jdt.core.groovy.tests.search.ConstructorReferenceSearchTests.testConstructorReferences10(ConstructorReferenceSearchTests.java:258)
Existing test failures 1
Status Test Failing since View job Duration
junit.framework.ComparisonFailure: 
----------- Expected ------------

------------ but was ------------
Problem : The import util.MyException is never used [ resource : </Project/src/p/Test.java> range : <18,34> category : <120> severity : <1>]

--------- Difference is ----------
 expected:<[]> but was:<[Problem : The import util.MyException is never used [ resource : </Project/src/p/Test.java> range : <18,34> category : <120> severity : <1>]
(12 more lines...)
Fixed tests 49
Status Test Failing since View job Duration
Successful RenameFieldTests test13 History
Failing since build #464 (Changes by Eric Milles) Default Job 1 sec
Successful RenameFieldTests test14 History
Failing since build #464 (Changes by Eric Milles) Default Job 1 sec
Successful RenameFieldTests test10 History
Failing since build #464 (Changes by Eric Milles) Default Job 5 secs
Successful RenameFieldTests test11 History
Failing since build #464 (Changes by Eric Milles) Default Job 1 sec
Successful RenameFieldTests test9 History
Failing since build #464 (Changes by Eric Milles) Default Job 1 sec
Successful RenameFieldTests test7 History
Failing since build #464 (Changes by Eric Milles) Default Job 1 sec
Successful RenameFieldTests test8 History
Failing since build #464 (Changes by Eric Milles) Default Job 1 sec
Successful RenameFieldTests test2 History
Failing since build #464 (Changes by Eric Milles) Default Job 1 sec
Successful RenameFieldTests test5 History
Failing since build #464 (Changes by Eric Milles) Default Job 1 sec
Successful RenameFieldTests test6 History
Failing since build #464 (Changes by Eric Milles) Default Job 1 sec
Successful RenameFieldTests test3 History
Failing since build #464 (Changes by Eric Milles) Default Job 1 sec
Successful RenameFieldTests test4 History
Failing since build #464 (Changes by Eric Milles) Default Job 1 sec
Successful RenameFieldTests testScript2 History
Failing since build #464 (Changes by Eric Milles) Default Job 1 sec
Successful RenameFieldTests testScript1 History
Failing since build #464 (Changes by Eric Milles) Default Job 1 sec
Successful RenameFieldTests testInitializer1 History
Failing since build #464 (Changes by Eric Milles) Default Job 1 sec
Successful RenameFieldTests testInitializer2 History
Failing since build #464 (Changes by Eric Milles) Default Job 1 sec
Successful RenameFieldTests testInitializer3 History
Failing since build #464 (Changes by Eric Milles) Default Job 1 sec
Successful RenameTypeTests test7 History
Failing since build #464 (Changes by Eric Milles) Default Job 1 sec
Successful RenameTypeTests test8 History
Failing since build #464 (Changes by Eric Milles) Default Job 1 sec
Successful RenameTypeTests test5 History
Failing since build #464 (Changes by Eric Milles) Default Job 1 sec
Successful RenameTypeTests test6 History
Failing since build #464 (Changes by Eric Milles) Default Job 1 sec
Successful RenameTypeTests testAlias1 History
Failing since build #464 (Changes by Eric Milles) Default Job 1 sec
Successful RenameTypeTests testInner1 History
Failing since build #464 (Changes by Eric Milles) Default Job 1 sec
Successful RenameTypeTests testInner2 History
Failing since build #464 (Changes by Eric Milles) Default Job 1 sec
Successful RenameTypeTests testInner3 History
Failing since build #464 (Changes by Eric Milles) Default Job 1 sec
Successful RenameTypeTests testAnnotation2 History
Failing since build #464 (Changes by Eric Milles) Default Job 1 sec
Successful RenameTypeTests testAnnotation3 History
Failing since build #464 (Changes by Eric Milles) Default Job 1 sec
Successful RenameTypeTests testAnnotation1 History
Failing since build #464 (Changes by Eric Milles) Default Job 1 sec
Successful RenameTypeTests testJavadoc1 History
Failing since build #464 (Changes by Eric Milles) Default Job 1 sec
Successful RenameTypeTests testEnum1 History
Failing since build #464 (Changes by Eric Milles) Default Job 1 sec
Successful RenameTypeTests testEnum2 History
Failing since build #464 (Changes by Eric Milles) Default Job 1 sec
Successful RenameTypeTests test13 History
Failing since build #464 (Changes by Eric Milles) Default Job 1 sec
Successful RenameTypeTests test12 History
Failing since build #464 (Changes by Eric Milles) Default Job 1 sec
Successful RenameTypeTests test11 History
Failing since build #464 (Changes by Eric Milles) Default Job 1 sec
Successful RenameTypeTests test10 History
Failing since build #464 (Changes by Eric Milles) Default Job 1 sec
Successful RenameTypeTests testGenerics1 History
Failing since build #464 (Changes by Eric Milles) Default Job 1 sec
Successful RenameTypeTests testGenerics2 History
Failing since build #464 (Changes by Eric Milles) Default Job 1 sec
Successful RenameTypeTests testGenerics3 History
Failing since build #464 (Changes by Eric Milles) Default Job 1 sec
Successful RenameTypeTests testGenerics4 History
Failing since build #464 (Changes by Eric Milles) Default Job 1 sec
Successful RenameTypeTests testGenerics5 History
Failing since build #464 (Changes by Eric Milles) Default Job 1 sec
Successful RenameTypeTests test9 History
Failing since build #464 (Changes by Eric Milles) Default Job 1 sec
Successful RenameTypeTests test3 History
Failing since build #464 (Changes by Eric Milles) Default Job 1 sec
Successful RenameTypeTests test4 History
Failing since build #464 (Changes by Eric Milles) Default Job 1 sec
Successful RenameTypeTests test1 History
Failing since build #464 (Changes by Eric Milles) Default Job 1 sec
Successful RenameTypeTests test2 History
Failing since build #464 (Changes by Eric Milles) Default Job 1 sec
Successful BinarySearchTests testClassDecl1 History
Failing since build #464 (Changes by Eric Milles) Default Job 1 sec
Successful BinarySearchTests testMethodDecl History
Failing since build #464 (Changes by Eric Milles) Default Job < 1 sec
Successful ConstructorReferenceSearchTests testConstructorReferences11a History
Failing since build #464 (Changes by Eric Milles) Default Job < 1 sec
Successful TypeReferenceSearchTests testFindClassDeclarationWithPattern History
Failing since build #464 (Changes by Eric Milles) Default Job < 1 sec
Skipped tests 100
Status Test Failing since View job
Skipped ConstructorCompletionTests testNamedArgumentTrigger2 History
Default Job
Skipped DefaultGroovyMethodCompletionTests testDateGM History
Default Job
Skipped MethodCompletionTests testMethodPointer4a History
Default Job
Skipped MethodCompletionTests testMethodPointer2a History
Default Job
Skipped MethodCompletionTests testMethodPointer3a History
Default Job
Skipped MethodCompletionTests testMethodPointer1a History
Default Job
Skipped RelevanceTests testNewMethodThenModifier History
Default Job
Skipped CodeSelectKeywordsTests testCodeSelectKeywordDef5 History
Default Job
Skipped CodeSelectKeywordsTests testCodeSelectKeywordDef4 History
Default Job
Skipped CodeSelectTypesTests testSelectPackageOnFullyQualifiedName7b History
Default Job
Skipped CodeSelectTypesTests testSelectPackageOnFullyQualifiedName7 History
Default Job
Skipped CodeSelectTypesTests testSelectPackageOnFullyQualifiedName7a History
Default Job
Skipped BuiltInDSLInferencingTests testSwingBuilder1 History
Default Job
Skipped BuiltInDSLInferencingTests testSwingBuilder2 History
Default Job
Skipped DSLContentAssistTests testSwingBuilder3 History
Default Job
Skipped DSLContentAssistTests testSwingBuilder1 History
Default Job
Skipped DSLContentAssistTests testSwingBuilder2 History
Default Job
Skipped MoveCURefactoringTests testInnerMove3 History
Default Job
Skipped MoveCURefactoringTests testInnerMove4 History
Default Job
Skipped MoveCURefactoringTests testInnerMove2 History
Default Job
Skipped MoveCURefactoringTests testInnerMove1 History
Default Job
Skipped RenameMethodTests testEnumOverrides3 History
Default Job
Skipped RenameMethodTests testDelegate1 History
Default Job
Skipped RenameMethodTests testDelegate2 History
Default Job
Skipped ExpressionFinderTests testComplex4 History
Default Job
Skipped ExpressionFinderTests testNoExpression1 History
Default Job
Skipped GroovyScriptLaunchShortcutTests testScriptLaunch11 History
Default Job
Skipped SemanticHighlightingTests testAnnoElems2 History
Default Job
Skipped SemanticHighlightingTests testVarKeyword3 History
Default Job
Skipped SemanticHighlightingTests testVarKeyword7 History
Default Job
Skipped SemanticHighlightingTests testTailCallMethods History
Default Job
Skipped SemanticHighlightingTests testMethodReference History
Default Job
Skipped SemanticHighlightingTests testForParams2 History
Default Job
Skipped SemanticHighlightingTests testForParams3 History
Default Job
Skipped SemanticHighlightingTests testForParams1 History
Default Job
Skipped SemanticHighlightingTests testVarKeyword4 History
Default Job
Skipped SemanticHighlightingTests testVarKeyword5 History
Default Job
Skipped SemanticHighlightingTests testVarKeyword6 History
Default Job
Skipped BasicGroovyBuildTests testSpock_GRE605_2 History
Default Job
Skipped BasicGroovyBuildTests testSpock_GRE605_1 History
Default Job
Skipped BasicGroovyBuildTests testSpock_GRE558 History
Default Job
Skipped SourceLocationsTests testSourceLocationsTrailingWhitespace2 History
Default Job
Skipped SourceLocationsTests testSourceLocationsTrailingWhitespace1 History
Default Job
Skipped SourceLocationsTests testErrorPositionForUnsupportedOperation History
Default Job
Skipped GroovyPartialModelTests testFieldInitializerIsAvailable4 History
Default Job
Skipped GroovyPartialModelTests testFieldInitializerIsAvailable3 History
Default Job
Skipped DGMInferencingTests testDGM45a History
Default Job
Skipped DGMInferencingTests testDGSMDeclaring1 History
Default Job
Skipped DGMInferencingTests testDGM43 History
Default Job
Skipped GenericInferencingTests testJira1718 History
Default Job
Skipped GenericInferencingTests testStaticMethod8 History
Default Job
Skipped Groovy25InferencingTests org.eclipse.jdt.core.groovy.tests.search.Groovy25InferencingTests History
Default Job
Skipped InferencingTests testGetAt8 History
Default Job
Skipped InferencingTests testGetAt9 History
Default Job
Skipped MethodReferenceSearchTests testMethodWithDefaultParameters4 History
Default Job
Skipped MethodReferenceSearchTests testOverloadedMethodReferences5a History
Default Job
Skipped SpockInferencingTests testEqualsCheck History
Default Job
Skipped SpockInferencingTests testPropertyCheck History
Default Job
Skipped SpockInferencingTests testGetterCheck History
Default Job
Skipped SpockInferencingTests testBasics History
Default Job
Skipped SpockInferencingTests testDataTableChecks History
Default Job
Skipped StaticInferencingTests testStaticImport14 History
Default Job
Skipped StaticInferencingTests testStaticImport13 History
Default Job
Skipped StaticInferencingTests testStaticImport15 History
Default Job
Skipped AnnotationsTests testCharLiteralAttributeValue[Java 1.8] History
Default Job
Skipped AnnotationsTests testDoubleLiteralAttributeDefault2a[Java 1.8] History
Default Job
Skipped AnnotationsTests testDoubleLiteralAttributeDefault2[Java 1.8] History
Default Job
Skipped AnnotationsTests testDoubleLiteralAttributeDefault2a[Java 1.7] History
Default Job
Skipped AnnotationsTests testDoubleLiteralAttributeDefault2[Java 1.7] History
Default Job
Skipped AnnotationsTests testLongLiteralAttributeDefault2a[Java 1.8] History
Default Job
Skipped AnnotationsTests testLongLiteralAttributeDefault2[Java 1.7] History
Default Job
Skipped AnnotationsTests testLongLiteralAttributeDefault2a[Java 1.7] History
Default Job
Skipped AnnotationsTests testFloatLiteralAttributeDefault2a[Java 1.7] History
Default Job
Skipped AnnotationsTests testFloatLiteralAttributeDefault2a[Java 1.8] History
Default Job
Skipped AnnotationsTests testCharLiteralAttributeValue[Java 1.7] History
Default Job
Skipped AnnotationsTests testFloatLiteralAttributeDefault2[Java 1.8] History
Default Job
Skipped AnnotationsTests testLongLiteralAttributeDefault2[Java 1.8] History
Default Job
Skipped AnnotationsTests testFloatLiteralAttributeDefault2[Java 1.7] History
Default Job
Skipped EnumerationTests testEnums5b[Java 1.8] History
Default Job
Skipped EnumerationTests testEnums5b[Java 1.7] History
Default Job
Skipped GenericsTests testJava7_2[Java 1.7] History
Default Job
Skipped GenericsTests testGenericsPositions_6_GRE267[Java 1.8] History
Default Job
Skipped GenericsTests testGenericsPositions_6_GRE267[Java 1.7] History
Default Job
Skipped GenericsTests testExtendingGenerics_GroovyExtendsJava06[Java 1.8] History
Default Job
Skipped GenericsTests testExtendingGenerics_GroovyExtendsJava07[Java 1.8] History
Default Job
Skipped GenericsTests testExtendingGenerics_GroovyExtendsJava08[Java 1.8] History
Default Job
Skipped GenericsTests testJava7_2[Java 1.8] History
Default Job
Skipped GroovySimpleTests testMultiCatch0[Java 1.7] History
Default Job
Skipped GroovySimpleTests testMultiCatch0[Java 1.8] History
Default Job
Skipped Java8Tests testNonRepeatableAnnotation[Java 1.7] History
Default Job
Skipped Java8Tests testRepeatableAnnotation3[Java 1.7] History
Default Job
Skipped Java8Tests testFunctionalInterfaceCoercion[Java 1.7] History
Default Job
Skipped Java8Tests testRepeatableAnnotation2[Java 1.7] History
Default Job
Skipped Java8Tests testRepeatableAnnotation1[Java 1.7] History
Default Job
Skipped Java8Tests testDefaultAndStaticMethodInInterface[Java 1.7] History
Default Job
Skipped TraitsTests testTraits51[Java 1.7] History
Default Job
Skipped TraitsTests testTraits51[Java 1.8] History
Default Job
Skipped CanonicalTests testCanonical1[Java 1.7] History
Default Job
Skipped CanonicalTests testCanonical1[Java 1.8] History
Default Job
Skipped GrabTests org.eclipse.jdt.groovy.core.tests.xform.GrabTests History
Default Job