Build: #467 failed Changes by Eric Milles

Build result summary

Details

Completed
Duration
97 minutes
Labels
None
Agent
bamboo-19.af.pivotal.io
Revision
01658be472ad0b3bc1476370309baa8358eabf66 01658be472ad0b3bc1476370309baa8358eabf66
Total tests
6078
Failing since
#448 (Changes by Eric Milles)

Responsible

Code commits

Author Commit Message Commit date
Eric Milles Eric Milles 01658be472ad0b3bc1476370309baa8358eabf66 01658be472ad0b3bc1476370309baa8358eabf66 reduce conflicts and compilation

Configuration changes

Plan configuration has changed since the last successful build. See the plan audit log for more details.

Tests

New test failures 33
Status Test View job Duration
Collapse Failed SyntheticAccessorRenamingTests testSubclassAccess1 History
Default Job 4 secs
org.junit.ComparisonFailure: Refactoring produced unexpected results: expected:<package q
p.Two.foo[Bar
p.Two.getFooBar()
p.Two.setFooBar](null)
> but was:<package q
p.Two.foo[
p.Two.getFoo()
p.Two.setFoo](null)
(13 more lines...)
Collapse Failed SyntheticAccessorRenamingTests testAliasedAccess History
Default Job 1 sec
org.junit.ComparisonFailure: Refactoring produced unexpected results: expected:<...tatic p.First.getFoo[Bar as blah
import static p.First.getFooBar] as getF
class First...> but was:<...tatic p.First.getFoo[ as blah
import static p.First.getFoo] as getF
class First...>
org.junit.ComparisonFailure: 
Refactoring produced unexpected results: expected:<...tatic p.First.getFoo[Bar as blah
import static p.First.getFooBar] as getF
(5 more lines...)
Collapse Failed SyntheticAccessorRenamingTests testFieldAndGetterAndSetter2 History
Default Job 1 sec
org.junit.ComparisonFailure: Refactoring produced unexpected results: expected:<... getFoo() { this.foo[Bar.get() }
  void setFoo(int value) { this.fooBar].set(value) }
}
> but was:<... getFoo() { this.foo[.get() }
  void setFoo(int value) { this.foo].set(value) }
}
>
org.junit.ComparisonFailure: 
(9 more lines...)
Collapse Failed SyntheticAccessorRenamingTests testFieldAndGetterAndSetter3 History
Default Job 1 sec
org.eclipse.core.runtime.AssertionFailedException: assertion failed: 
	at org.codehaus.groovy.eclipse.refactoring.test.rename.SyntheticAccessorRenamingTests.performRefactoringAndUndo(SyntheticAccessorRenamingTests.groovy:52)
	at org.codehaus.groovy.eclipse.refactoring.test.rename.SyntheticAccessorRenamingTests.testFieldAndGetterAndSetter3(SyntheticAccessorRenamingTests.groovy:1365)
Collapse Failed SyntheticAccessorRenamingTests testSingleFileRename1 History
Default Job 1 sec
org.junit.ComparisonFailure: Refactoring produced unexpected results: expected:<...
  def run() {
    f[lar
    isFlar()
    getFlar()
    setFlar(true)
    this.&isFlar
    this.&getFlar
(41 more lines...)
Collapse Failed SyntheticAccessorRenamingTests testMultiFileRename1 History
Default Job 1 sec
org.junit.ComparisonFailure: Refactoring produced unexpected results: expected:<... = new p.First()
f.f[lar
f.isFlar()
f.getFlar()
f.setFlar](true)
> but was:<... = new p.First()
f.f[oo
f.isFoo()
(17 more lines...)
Collapse Failed SyntheticAccessorRenamingTests testSingleFileRename3 History
Default Job 1 sec
org.junit.ComparisonFailure: Refactoring produced unexpected results: expected:<...
  def run() {
    f[lar]
    isFoo()
    get...> but was:<...
  def run() {
    f[oo]
    isFoo()
(13 more lines...)
Collapse Failed SyntheticAccessorRenamingTests testMultiFileRename2 History
Default Job < 1 sec
org.junit.ComparisonFailure: Refactoring produced unexpected results: expected:<package q
p.First.f[lar
p.First.isFlar()
p.First.getFlar()
p.First.setFlar](true)
> but was:<package q
p.First.f[oo
p.First.isFoo()
(17 more lines...)
Collapse Failed SyntheticAccessorRenamingTests testSingleFileRename2 History
Default Job 1 sec
org.junit.ComparisonFailure: Refactoring produced unexpected results: expected:<...lar
  static {
    f[lar
    isFlar()
    getFlar()
    setFlar(true)
    this.&isFlar
    this.&getFlar
(41 more lines...)
Collapse Failed SyntheticAccessorRenamingTests testSingleFileRename4 History
Default Job 1 sec
org.junit.ComparisonFailure: Refactoring produced unexpected results: expected:<... {}
  static {
    f[lar]
    isFoo()
    get...> but was:<... {}
  static {
    f[oo]
    isFoo()
(13 more lines...)
Collapse Failed SyntheticAccessorRenamingTests testMultiFileRename5 History
Default Job < 1 sec
org.eclipse.core.runtime.AssertionFailedException: assertion failed: Search for method declaration did not find original element: int getFoo() [in Pojo [in Pojo.java [in p [in src [in TestProject]]]]]
	at org.codehaus.groovy.eclipse.refactoring.test.rename.SyntheticAccessorRenamingTests.performRefactoringAndUndo(SyntheticAccessorRenamingTests.groovy:52)
	at org.codehaus.groovy.eclipse.refactoring.test.rename.SyntheticAccessorRenamingTests.testMultiFileRename5(SyntheticAccessorRenamingTests.groovy:417)
Collapse Failed SyntheticAccessorRenamingTests testStaticSetterOnly4 History
Default Job 1 sec
org.junit.ComparisonFailure: Refactoring produced unexpected results: expected:<... m() {
  p.First.foo[Bar] // potential match
...> but was:<... m() {
  p.First.foo[] // potential match
...>
org.junit.ComparisonFailure: 
Refactoring produced unexpected results: expected:<... m() {
  p.First.foo[Bar] // potential match
(5 more lines...)
Collapse Failed SyntheticAccessorRenamingTests testMultiFileRename6 History
Default Job 1 sec
org.eclipse.core.runtime.AssertionFailedException: assertion failed: Search for method declaration did not find original element: void setFoo(int) [in Pojo [in Pojo.java [in p [in src [in TestProject]]]]]
	at org.codehaus.groovy.eclipse.refactoring.test.rename.SyntheticAccessorRenamingTests.performRefactoringAndUndo(SyntheticAccessorRenamingTests.groovy:52)
	at org.codehaus.groovy.eclipse.refactoring.test.rename.SyntheticAccessorRenamingTests.testMultiFileRename6(SyntheticAccessorRenamingTests.groovy:464)
Collapse Failed SyntheticAccessorRenamingTests testStaticSetterOnly2 History
Default Job 1 sec
org.junit.ComparisonFailure: Refactoring produced unexpected results: expected:<... static p.First.setF[lar;
class Java {
  void m() {
    foo = null; // error
    setFlar](null);
  }
}
> but was:<... static p.First.setF[oo;
(25 more lines...)
Collapse Failed SyntheticAccessorRenamingTests testStaticSetterOnly1 History
Default Job 1 sec
org.junit.ComparisonFailure: Refactoring produced unexpected results: expected:<... m() {
    p.First.f[lar = null; // error
    p.First.setFlar](null);
  }
}
> but was:<... m() {
    p.First.f[oo = null; // error
    p.First.setFoo](null);
(17 more lines...)
Collapse Failed SyntheticAccessorRenamingTests testMultiFileRename7 History
Default Job 1 sec
org.eclipse.core.runtime.AssertionFailedException: assertion failed: 
	at org.codehaus.groovy.eclipse.refactoring.test.rename.SyntheticAccessorRenamingTests.performRefactoringAndUndo(SyntheticAccessorRenamingTests.groovy:52)
	at org.codehaus.groovy.eclipse.refactoring.test.rename.SyntheticAccessorRenamingTests.testMultiFileRename7(SyntheticAccessorRenamingTests.groovy:513)
Collapse Failed SyntheticAccessorRenamingTests testIsserOnly History
Default Job 1 sec
org.eclipse.core.runtime.AssertionFailedException: assertion failed: Search for method declaration did not find original element: java.lang.Object isFoo() [in First [in First.groovy [in p [in src [in TestProject]]]]]
	at org.codehaus.groovy.eclipse.refactoring.test.rename.SyntheticAccessorRenamingTests.performRefactoringAndUndo(SyntheticAccessorRenamingTests.groovy:52)
	at org.codehaus.groovy.eclipse.refactoring.test.rename.SyntheticAccessorRenamingTests.testIsserOnly(SyntheticAccessorRenamingTests.groovy:716)
Collapse Failed SyntheticAccessorRenamingTests testGetterOnly History
Default Job 1 sec
org.eclipse.core.runtime.AssertionFailedException: assertion failed: Search for method declaration did not find original element: java.lang.Object getFoo() [in First [in First.groovy [in p [in src [in TestProject]]]]]
	at org.codehaus.groovy.eclipse.refactoring.test.rename.SyntheticAccessorRenamingTests.performRefactoringAndUndo(SyntheticAccessorRenamingTests.groovy:52)
	at org.codehaus.groovy.eclipse.refactoring.test.rename.SyntheticAccessorRenamingTests.testGetterOnly(SyntheticAccessorRenamingTests.groovy:663)
Collapse Failed SyntheticAccessorRenamingTests testJavaRename2 History
Default Job < 1 sec
org.junit.ComparisonFailure: Refactoring produced unexpected results: expected:<...p.First f) {
    f.f[lar] = null;
    f.isFoo...> but was:<...p.First f) {
    f.f[oo] = null;
    f.isFoo...>
org.junit.ComparisonFailure: 
Refactoring produced unexpected results: expected:<...p.First f) {
    f.f[lar] = null;
(5 more lines...)
Collapse Failed SyntheticAccessorRenamingTests testJavaRename1 History
Default Job 1 sec
org.junit.ComparisonFailure: Refactoring produced unexpected results: expected:<...p.First f) {
    f.f[lar = null;
    f.isFlar();
    f.getFlar();
    f.setFlar](true);
  }
}
> but was:<...p.First f) {
(25 more lines...)
Collapse Failed SyntheticAccessorRenamingTests testStaticIsserOnly2 History
Default Job 1 sec
org.junit.ComparisonFailure: Refactoring produced unexpected results: expected:<...t static p.First.isF[lar;
class Java {
  void m() {
    boolean b = foo; // error
    b = isFlar]();
  }
}
> but was:<...t static p.First.isF[oo;
(25 more lines...)
Collapse Failed SyntheticAccessorRenamingTests testStaticGetterOnly2 History
Default Job 1 sec
org.junit.ComparisonFailure: Refactoring produced unexpected results: expected:<... static p.First.getF[lar;
class Java {
  void m() {
    Object o = foo; // error
    o = getFlar]();
  }
}
> but was:<... static p.First.getF[oo;
(25 more lines...)
Collapse Failed SyntheticAccessorRenamingTests testStaticIsserOnly1 History
Default Job 1 sec
org.junit.ComparisonFailure: Refactoring produced unexpected results: expected:<...oolean b = p.First.f[lar; // error
    b = p.First.isFlar]();
  }
}
> but was:<...oolean b = p.First.f[oo; // error
    b = p.First.isFoo]();
  }
}
(13 more lines...)
Collapse Failed SyntheticAccessorRenamingTests testStaticGetterOnly1 History
Default Job 1 sec
org.junit.ComparisonFailure: Refactoring produced unexpected results: expected:<...Object o = p.First.f[lar; // error
    o = p.First.getFlar]();
  }
}
> but was:<...Object o = p.First.f[oo; // error
    o = p.First.getFoo]();
  }
}
(13 more lines...)
Collapse Failed SyntheticAccessorRenamingTests testSetterOnly2 History
Default Job < 1 sec
org.eclipse.core.runtime.AssertionFailedException: assertion failed: Search for method declaration did not find original element: void setFoo(java.lang.Object) [in First [in First.groovy [in p [in src [in TestProject]]]]]
	at org.codehaus.groovy.eclipse.refactoring.test.rename.SyntheticAccessorRenamingTests.performRefactoringAndUndo(SyntheticAccessorRenamingTests.groovy:52)
	at org.codehaus.groovy.eclipse.refactoring.test.rename.SyntheticAccessorRenamingTests.testSetterOnly2(SyntheticAccessorRenamingTests.groovy:802)
Collapse Failed SyntheticAccessorRenamingTests testSetterOnly1 History
Default Job < 1 sec
org.eclipse.core.runtime.AssertionFailedException: assertion failed: Search for method declaration did not find original element: void setFoo(java.lang.Object) [in First [in First.groovy [in p [in src [in TestProject]]]]]
	at org.codehaus.groovy.eclipse.refactoring.test.rename.SyntheticAccessorRenamingTests.performRefactoringAndUndo(SyntheticAccessorRenamingTests.groovy:52)
	at org.codehaus.groovy.eclipse.refactoring.test.rename.SyntheticAccessorRenamingTests.testSetterOnly1(SyntheticAccessorRenamingTests.groovy:769)
Collapse Failed SyntheticAccessorRenamingTests testFieldAndGetterAndSetter1 History
Default Job 1 sec
org.junit.ComparisonFailure: Refactoring produced unexpected results: expected:<...() { return this.foo[Bar }
  void setFoo(int value) { this.fooBar] = value }
}
> but was:<...() { return this.foo[ }
  void setFoo(int value) { this.foo] = value }
}
>
org.junit.ComparisonFailure: 
(9 more lines...)
Collapse Failed SyntheticAccessorRenamingTests testConstructorAccess History
Default Job 1 sec
org.junit.ComparisonFailure: Refactoring produced unexpected results: expected:<...def one = new p.One([boo: null)
def two = new p.Two(b]oo: null, bar: null)...> but was:<...def one = new p.One([foo: null)
def two = new p.Two(f]oo: null, bar: null)...>
org.junit.ComparisonFailure: 
Refactoring produced unexpected results: expected:<...def one = new p.One([boo: null)
def two = new p.Two(b]oo: null, bar: null)...> but was:<...def one = new p.One([foo: null)
def two = new p.Two(f]oo: null, bar: null)...>
	at org.codehaus.groovy.eclipse.refactoring.test.rename.SyntheticAccessorRenamingTests.performRefactoringAndUndo(SyntheticAccessorRenamingTests.groovy:53)
(1 more lines...)
Collapse Failed SyntheticAccessorRenamingTests testFieldAndGetterAndSetter4 History
Default Job 1 sec
org.eclipse.core.runtime.AssertionFailedException: assertion failed: 
	at org.codehaus.groovy.eclipse.refactoring.test.rename.SyntheticAccessorRenamingTests.performRefactoringAndUndo(SyntheticAccessorRenamingTests.groovy:52)
	at org.codehaus.groovy.eclipse.refactoring.test.rename.SyntheticAccessorRenamingTests.testFieldAndGetterAndSetter4(SyntheticAccessorRenamingTests.groovy:1410)
Collapse Failed SyntheticAccessorRenamingTests testSubclassAccess2 History
Default Job 1 sec
org.junit.ComparisonFailure: Refactoring produced unexpected results: expected:<... new p.Two()
two.foo[Bar
two.getFooBar()
two.setFooBar](null)
> but was:<... new p.Two()
two.foo[
two.getFoo()
two.setFoo](null)
(13 more lines...)
Collapse Failed BinarySearchTests testClassDecl1 History
Default Job 1 sec
java.lang.AssertionError: Expecting 12 matches, but found 0

java.lang.AssertionError: 
Expecting 12 matches, but found 0

	at org.eclipse.jdt.core.groovy.tests.search.BinarySearchTests.assertMatches(BinarySearchTests.java:139)
	at org.eclipse.jdt.core.groovy.tests.search.BinarySearchTests.testClassDecl1(BinarySearchTests.java:165)
Collapse Failed ConstructorReferenceSearchTests testNewifyConstructorReferences1 History
Default Job < 1 sec
org.eclipse.jdt.core.JavaModelException: Foo [in Foo.groovy [in p [in src [in Project]]]] does not exist
	at org.eclipse.jdt.core.groovy.tests.search.ConstructorReferenceSearchTests.testNewifyConstructorReferences1(ConstructorReferenceSearchTests.java:384)
Collapse Failed MethodReferenceSearchTests testExplicitPropertyGetterSearch2 History
Default Job < 1 sec
java.lang.AssertionError: expected:<4> but was:<0>
	at org.eclipse.jdt.core.groovy.tests.search.MethodReferenceSearchTests.testExplicitPropertyGetterSearch2(MethodReferenceSearchTests.java:528)
Existing test failures 1
Status Test Failing since View job Duration
junit.framework.ComparisonFailure: 
----------- Expected ------------

------------ but was ------------
Problem : The import util.MyException is never used [ resource : </Project/src/p/Test.java> range : <18,34> category : <120> severity : <1>]

--------- Difference is ----------
 expected:<[]> but was:<[Problem : The import util.MyException is never used [ resource : </Project/src/p/Test.java> range : <18,34> category : <120> severity : <1>]
(12 more lines...)