Build: #502 failed Changes by Eric Milles

Build result summary

Details

Completed
Duration
97 minutes
Labels
None
Agent
bamboo-19.af.pivotal.io
Revision
7d8c5d1afee9e188f10246b8eeb77d67395dde0c 7d8c5d1afee9e188f10246b8eeb77d67395dde0c
Total tests
6145
Failing since
#448 (Changes by Eric Milles)

Responsible

Code commits

Author Commit Message Commit date
Eric Milles Eric Milles 7d8c5d1afee9e188f10246b8eeb77d67395dde0c 7d8c5d1afee9e188f10246b8eeb77d67395dde0c Fix for #988: rework non-synthetic property-style references to methods

Configuration changes

Plan configuration has changed since the last successful build. See the plan audit log for more details.

Tests

New test failures 8
Status Test View job Duration
Collapse Failed MainMethodFinderTests testMainMethodFinder1 History
Default Job 5 secs
java.lang.AssertionError: Wrong number of main methods found in: []. Expression: (types.length == expected.length)
	at org.codehaus.groovy.eclipse.junit.test.MainMethodFinderTests.expectTypesWithMain(MainMethodFinderTests.groovy:37)
	at org.codehaus.groovy.eclipse.junit.test.MainMethodFinderTests.testMainMethodFinder1(MainMethodFinderTests.groovy:51)
Collapse Failed MainMethodFinderTests testMainMethodFinder6 History
Default Job 1 sec
java.lang.AssertionError: Wrong number of main methods found in: []. Expression: (types.length == expected.length)
	at org.codehaus.groovy.eclipse.junit.test.MainMethodFinderTests.expectTypesWithMain(MainMethodFinderTests.groovy:37)
	at org.codehaus.groovy.eclipse.junit.test.MainMethodFinderTests.testMainMethodFinder6(MainMethodFinderTests.groovy:104)
Collapse Failed MainMethodFinderTests testMainMethodFinder7 History
Default Job 2 secs
java.lang.AssertionError: Wrong number of main methods found in: []. Expression: (types.length == expected.length)
	at org.codehaus.groovy.eclipse.junit.test.MainMethodFinderTests.expectTypesWithMain(MainMethodFinderTests.groovy:37)
	at org.codehaus.groovy.eclipse.junit.test.MainMethodFinderTests.testMainMethodFinder7(MainMethodFinderTests.groovy:117)
Collapse Failed MainMethodFinderTests testMainMethodFinder8 History
Default Job 2 secs
java.lang.AssertionError: Wrong number of main methods found in: []. Expression: (types.length == expected.length)
	at org.codehaus.groovy.eclipse.junit.test.MainMethodFinderTests.expectTypesWithMain(MainMethodFinderTests.groovy:37)
	at org.codehaus.groovy.eclipse.junit.test.MainMethodFinderTests.testMainMethodFinder8(MainMethodFinderTests.groovy:133)
Collapse Failed BinarySearchTests testFieldRefInInitializer History
Default Job 1 sec
java.lang.AssertionError: Expecting 1 matches, but found 0

java.lang.AssertionError: 
Expecting 1 matches, but found 0

	at org.eclipse.jdt.core.groovy.tests.search.BinarySearchTests.assertMatches(BinarySearchTests.java:139)
	at org.eclipse.jdt.core.groovy.tests.search.BinarySearchTests.testFieldRefInInitializer(BinarySearchTests.java:208)
Collapse Failed ConstructorReferenceSearchTests testNewifyConstructorReferences4 History
Default Job < 1 sec
java.lang.AssertionError: expected:<2> but was:<0>
	at org.eclipse.jdt.core.groovy.tests.search.ConstructorReferenceSearchTests.testNewifyConstructorReferences4(ConstructorReferenceSearchTests.java:450)
Collapse Failed DGMInferencingTests testDGMClosure12 History
Default Job < 1 sec
java.lang.AssertionError: Expected type not found.
Expected: java.util.Date
Found: java.lang.Object
Declaring type: Search
ASTNode: org.codehaus.groovy.ast.expr.VariableExpression@f3ca0[variable: val]
Confidence: INFERRED

java.lang.AssertionError: 
(9 more lines...)
Collapse Failed MethodReferenceSearchTests testMethodWithDefaultParameters3 History
Default Job < 1 sec
java.lang.AssertionError: expected:<2> but was:<0>
	at org.eclipse.jdt.core.groovy.tests.search.MethodReferenceSearchTests.testMethodWithDefaultParameters3(MethodReferenceSearchTests.java:389)
Existing test failures 1
Status Test Failing since View job Duration
junit.framework.ComparisonFailure: 
----------- Expected ------------

------------ but was ------------
Problem : The import util.MyException is never used [ resource : </Project/src/p/Test.java> range : <18,34> category : <120> severity : <1>]

--------- Difference is ----------
 expected:<[]> but was:<[Problem : The import util.MyException is never used [ resource : </Project/src/p/Test.java> range : <18,34> category : <120> severity : <1>]
(12 more lines...)