Build: #504 failed Changes by Eric Milles

Build result summary

Details

Completed
Duration
94 minutes
Labels
None
Agent
bamboo-18.af.pivotal.io
Revision
3debe96df6d3c8a2b6c6b76f218293f5d3602e1f 3debe96df6d3c8a2b6c6b76f218293f5d3602e1f
Total tests
6149
Failing since
#448 (Changes by Eric Milles)

Responsible

Code commits

Author Commit Message Commit date
Eric Milles Eric Milles 3debe96df6d3c8a2b6c6b76f218293f5d3602e1f 3debe96df6d3c8a2b6c6b76f218293f5d3602e1f Eclipse 4.14 (M2) JDT Patch for Groovy-Eclipse: JDT commit 3106c52
#963 #964
Eric Milles Eric Milles 8155bf9cc9ad16073d6f01471a3d923bc19a3237 8155bf9cc9ad16073d6f01471a3d923bc19a3237 GROOVY-7722, GROOVY-7864

Configuration changes

Plan configuration has changed since the last successful build. See the plan audit log for more details.

Tests

New test failures 6
Status Test View job Duration
Collapse Failed BinarySearchTests testClassDecl1 History
Default Job 1 sec
java.lang.AssertionError: Expecting 12 matches, but found 0

java.lang.AssertionError: 
Expecting 12 matches, but found 0

	at org.eclipse.jdt.core.groovy.tests.search.BinarySearchTests.assertMatches(BinarySearchTests.java:139)
	at org.eclipse.jdt.core.groovy.tests.search.BinarySearchTests.testClassDecl1(BinarySearchTests.java:165)
Collapse Failed ClosureInferencingTests testWithAndClosure1 History
Default Job < 1 sec
java.lang.AssertionError: Expected type not found.
Expected: java.lang.String
Found: java.lang.Object
Declaring type: p.E
ASTNode: org.codehaus.groovy.ast.expr.VariableExpression@10ecc6[variable: foo]
Confidence: UNKNOWN

java.lang.AssertionError: 
(8 more lines...)
Collapse Failed ConstructorReferenceSearchTests testConstructorReferences1 History
Default Job < 1 sec
java.lang.AssertionError: Incorrect number of matches; expected:<3> but was:<0>
	at org.eclipse.jdt.core.groovy.tests.search.ConstructorReferenceSearchTests.testConstructorReferences1(ConstructorReferenceSearchTests.java:59)
Collapse Failed ConstructorReferenceSearchTests testConstructorReferences10 History
Default Job < 1 sec
java.lang.AssertionError: expected:<1> but was:<0>
	at org.eclipse.jdt.core.groovy.tests.search.ConstructorReferenceSearchTests.testConstructorReferences10(ConstructorReferenceSearchTests.java:258)
Collapse Failed DGMInferencingTests testDGMClosure15 History
Default Job < 1 sec
java.lang.AssertionError: Expected type not found.
Expected: java.lang.Integer
Found: java.lang.Object
Declaring type: Search
ASTNode: org.codehaus.groovy.ast.expr.VariableExpression@f0f88[variable: key]
Confidence: INFERRED

java.lang.AssertionError: 
(9 more lines...)
Collapse Failed TypeReferenceSearchTests testFindClassDeclarationWithPattern History
Default Job < 1 sec
java.lang.AssertionError: Number of results found expected:<2> but was:<0>
	at org.eclipse.jdt.core.groovy.tests.search.TypeReferenceSearchTests.testFindClassDeclarationWithPattern(TypeReferenceSearchTests.java:220)
Existing test failures 1
Status Test Failing since View job Duration
junit.framework.ComparisonFailure: 
----------- Expected ------------

------------ but was ------------
Problem : The import util.MyException is never used [ resource : </Project/src/p/Test.java> range : <18,34> category : <120> severity : <1>]

--------- Difference is ----------
 expected:<[]> but was:<[Problem : The import util.MyException is never used [ resource : </Project/src/p/Test.java> range : <18,34> category : <120> severity : <1>]
(12 more lines...)
Fixed tests 2
Status Test Failing since View job Duration
Successful ConstructorReferenceSearchTests testConstructorReferences12a History
Failing since build #503 (Changes by Eric Milles) Default Job < 1 sec
Successful ConstructorReferenceSearchTests testNewifyConstructorReferences2 History
Failing since build #503 (Changes by Eric Milles) Default Job < 1 sec

Jira issues

IssueDescriptionStatus
Unknown Issue TypeGROOVY-7722Could not obtain issue details from Jira
Unknown Issue TypeGROOVY-7864Could not obtain issue details from Jira