Build: #505 failed Changes by Eric Milles

Test results

  • 6,149 tests in total
  • 39 tests failed
  • 38 failures are new
  • 6 tests were fixed
  • 119 tests were quarantined / skipped
  • 88 minutes taken in total.
New test failures 38
Status Test View job Duration
Collapse Failed RenameTypeTests testGenerics5 History
Default Job 1 sec
org.junit.ComparisonFailure: expected:<...p

class C {
  List<[B> list1
  List<? super B> list2
  List<? extends B> list3
  List<Collection<B>> list4

(36 more lines...)
Collapse Failed RenameTypeTests testGenerics1 History
Default Job 1 sec
org.junit.ComparisonFailure: invalid renaming expected:<...X x) {}

    void m([B a) {
        new B<T>();
        new B<T>(null, "y");
    };
}

(59 more lines...)
Collapse Failed RenameTypeTests test13 History
Default Job 1 sec
org.junit.ComparisonFailure: invalid renaming expected:<...lic class B {
    B([B a){}
    B a(B a){
        a= new B(new B](a));
        return...> but was:<...lic class B {
    B([A a){}
    A a(A a){
        a= new A(new A](a));
(15 more lines...)
Collapse Failed RenameTypeTests testGenerics2 History
Default Job 1 sec
org.junit.ComparisonFailure: invalid renaming expected:<...A> {
    A a;
    p.[B pa= new p.B]();
}
> but was:<...A> {
    A a;
    p.[A pa= new p.A]();
}
(15 more lines...)
Collapse Failed RenameTypeTests test12 History
Default Job 1 sec
org.junit.ComparisonFailure: invalid renaming expected:<...  def x() {
        [B]
    }
}> but was:<...  def x() {
        [A]
    }
}>
org.junit.ComparisonFailure: 
(11 more lines...)
Collapse Failed RenameTypeTests testGenerics3 History
Default Job 1 sec
org.junit.ComparisonFailure: invalid renaming expected:<...  ArrayList<? super [B> fSink;
}

class U extends ArrayList<B> {
    public boolean add(B arg0) {
        return false;
    }
}
(35 more lines...)
Collapse Failed RenameTypeTests testGenerics4 History
Default Job 1 sec
org.junit.ComparisonFailure: invalid renaming expected:<...    Class<? extends [B> class1= this.getClass();
    Class<? extends B> class2= B.class;
    Class<B> class3= (Class<B>) this.getClass();
    X<B> getX() {
        X<B> x= new X<B>();
        x.t= (new ArrayList<B>() as B[]);
        return x;
    }
(51 more lines...)
Collapse Failed RenameTypeTests test11 History
Default Job 1 sec
org.junit.ComparisonFailure: invalid renaming expected:<...tatic x() {
        [B]
    }
}> but was:<...tatic x() {
        [A]
    }
}>
org.junit.ComparisonFailure: 
(11 more lines...)
Collapse Failed RenameTypeTests test10 History
Default Job 1 sec
org.junit.ComparisonFailure: invalid renaming expected:<...her {
    def x = { [B] a ->
              ...> but was:<...her {
    def x = { [A] a ->
              ...>
org.junit.ComparisonFailure: 
invalid renaming expected:<...her {
    def x = { [B] a ->
(7 more lines...)
Collapse Failed RenameTypeTests testInner3 History
Default Job 1 sec
org.junit.ComparisonFailure: expected:<...n.*
import static p.[Wrapper.Inner.*
import p.OuterAgain.InnerAgain
import p.Wrapper.Inner
import p.OuterAgain.*
import p.Wrapper.*

val = OuterAgain.InnerAgain.thing
(36 more lines...)
Collapse Failed RenameTypeTests testAlias1 History
Default Job 1 sec
org.junit.ComparisonFailure: invalid renaming in p2.A expected:<...ckage p2;

import p.[B] as Other;

class C ...> but was:<...ckage p2;

import p.[A] as Other;

(12 more lines...)
Collapse Failed RenameTypeTests testJavadoc1 History
Default Job 1 sec
org.junit.ComparisonFailure: invalid renaming expected:<package p;
/**
 * [B
 */
class B{ }

class Other {
    def x = {
(37 more lines...)
Collapse Failed RenameTypeTests test9 History
Default Job 1 sec
org.junit.ComparisonFailure: invalid renaming expected:<...f x = {
            [B a = new B]()
    }
}> but was:<...f x = {
            [A a = new A]()
    }
}>
org.junit.ComparisonFailure: 
(11 more lines...)
Collapse Failed RenameTypeTests test3 History
Default Job 1 sec
org.junit.ComparisonFailure: invalid renaming expected:<...erface B{
   void m([B a);
}

class Sub implements B {
    void m(B] a){}
}> but was:<...erface B{
   void m([A a);
(23 more lines...)
Collapse Failed RenameTypeTests test4 History
Default Job 1 sec
org.junit.ComparisonFailure: invalid renaming expected:<...kage p;
class B{
   [B] m(a) {}
}> but was:<...kage p;
class B{
   [A] m(a) {}
}>
org.junit.ComparisonFailure: 
(11 more lines...)
Collapse Failed RenameTypeTests test1 History
Default Job 1 sec
org.junit.ComparisonFailure: invalid renaming expected:<...
class B{
   void m([B] a){};
}> but was:<...
class B{
   void m([A] a){};
}>
org.junit.ComparisonFailure: 
(11 more lines...)
Collapse Failed RenameTypeTests test2 History
Default Job 1 sec
org.junit.ComparisonFailure: invalid renaming expected:<...
class B{
   void m([B a){};
}

class Sub extends B {
    void m(B] a){}
}> but was:<...
(27 more lines...)
Collapse Failed RenameTypeTests test7 History
Default Job 1 sec
org.junit.ComparisonFailure: invalid renaming expected:<...

class Other {
    [B x() {
        def x = {
                B a = new B]()
        }
    }
(31 more lines...)
Collapse Failed RenameTypeTests test8 History
Default Job 1 sec
org.junit.ComparisonFailure: invalid renaming expected:<...

class Other {
    [B x() {
        def x = { B] a ->
              ...> but was:<...

class Other {
(19 more lines...)
Collapse Failed RenameTypeTests test5 History
Default Job 1 sec
org.junit.ComparisonFailure: invalid renaming expected:<...  def x() {
        [B x = new B]()
    }
}> but was:<...  def x() {
        [A x = new A]()
    }
}>
org.junit.ComparisonFailure: 
(11 more lines...)
Collapse Failed RenameTypeTests test6 History
Default Job 1 sec
org.junit.ComparisonFailure: invalid renaming expected:<...

class Other {
    [B x = new B]()
}> but was:<...

class Other {
    [A x = new A]()
(15 more lines...)
Collapse Failed RenameTypeTests testEnum1 History
Default Job 1 sec
org.junit.ComparisonFailure: invalid renaming in p2.A expected:<...ckage p2;

import p.[B;

class C {
    p.B a= p.B.ONE;
    p.B b= p.B].ONE;
    C a2= new ...> but was:<...ckage p2;
(24 more lines...)
Collapse Failed RenameTypeTests testEnum2 History
Default Job 1 sec
org.junit.ComparisonFailure: invalid renaming expected:<...ONE ,
    BIG ;
    [B longerNameThan(B] a) { a }
}
> but was:<...ONE ,
    BIG ;
    [A longerNameThan(A] a) { a }
}
(15 more lines...)
Collapse Failed RenameTypeTests testInner1 History
Default Job 1 sec
org.junit.ComparisonFailure: invalid renaming expected:<...e p

import p.Outer.[B
import p.Outer.AZ

class Outer {
  class B {
  }
(85 more lines...)
Collapse Failed RenameTypeTests testInner2 History
Default Job 1 sec
org.junit.ComparisonFailure: invalid renaming expected:<...n.*
import static p.[Wrapper.Inner.*
import p.OuterAgain.InnerAgain
import p.Wrapper.Inner
import p.OuterAgain.*
import p.Wrapper.*

class Wrapper {
(85 more lines...)
Collapse Failed RenameTypeTests testAnnotation2 History
Default Job 1 sec
org.junit.ComparisonFailure: invalid renaming expected:<...interface Main {
   [B child() default @B("Void");
}

@Main(child=@/*test*/B(""))
@B("")
class Client {
    @Deprecated
(47 more lines...)
Collapse Failed RenameTypeTests testAnnotation3 History
Default Job 1 sec
org.junit.ComparisonFailure: invalid renaming expected:<... default "NULL";
}
@[B("")
class Test {
    
    @B("A and p.Test.A and p.A and q.Test.A")
    void test () {
        ArrayList<String> list= new ArrayList<String>() {
(39 more lines...)
Collapse Failed RenameTypeTests testAnnotation1 History
Default Job 1 sec
org.junit.ComparisonFailure: invalid renaming expected:<...
@interface B { }

@[B
class Client {
    @Deprecated @B]() void bad() { }
}> but was:<...
@interface B { }
(23 more lines...)
Collapse Failed BasicGroovyBuildTests testIncrementalCompilationTheBasics2_changingJavaDependedUponByGroovy History
Default Job < 1 sec
org.junit.ComparisonFailure: unexpected recompiled units. lenExpected=2 lenActual=1 expected:<{pkg.GHello[,pkg.Hello]}> but was:<{pkg.GHello[]}>
	at org.eclipse.jdt.core.groovy.tests.builder.BasicGroovyBuildTests.testIncrementalCompilationTheBasics2_changingJavaDependedUponByGroovy(BasicGroovyBuildTests.java:2236)
Collapse Failed BinarySearchTests testFieldDecl1 History
Default Job 1 sec
java.lang.AssertionError: Expecting 2 matches, but found 0

java.lang.AssertionError: 
Expecting 2 matches, but found 0

	at org.eclipse.jdt.core.groovy.tests.search.BinarySearchTests.assertMatches(BinarySearchTests.java:139)
	at org.eclipse.jdt.core.groovy.tests.search.BinarySearchTests.testFieldDecl1(BinarySearchTests.java:181)
Collapse Failed ClosureInferencingTests testNestedClosure11 History
Default Job < 1 sec
java.lang.AssertionError: Expected type not found.
Expected: java.lang.Integer
Found: Search
Declaring type: groovy.lang.Closure<V extends java.lang.Object>
ASTNode: org.codehaus.groovy.ast.expr.ConstantExpression@f9e59[delegate]
Confidence: INFERRED

java.lang.AssertionError: 
(8 more lines...)
Collapse Failed ConstructorReferenceSearchTests testConstructorReferences6 History
Default Job < 1 sec
java.lang.AssertionError: expected:<2> but was:<0>
	at org.eclipse.jdt.core.groovy.tests.search.ConstructorReferenceSearchTests.testConstructorReferences6(ConstructorReferenceSearchTests.java:180)
Collapse Failed ConstructorReferenceSearchTests testNewifyConstructorReferences1 History
Default Job < 1 sec
java.lang.AssertionError: expected:<2> but was:<0>
	at org.eclipse.jdt.core.groovy.tests.search.ConstructorReferenceSearchTests.testNewifyConstructorReferences1(ConstructorReferenceSearchTests.java:387)
Collapse Failed ConstructorReferenceSearchTests testConstructorReferences11a History
Default Job < 1 sec
java.lang.AssertionError: expected:<3> but was:<0>
	at org.eclipse.jdt.core.groovy.tests.search.ConstructorReferenceSearchTests.testConstructorReferences11a(ConstructorReferenceSearchTests.java:295)
Collapse Failed ConstructorReferenceSearchTests testConstructorReferences13 History
Default Job < 1 sec
java.lang.AssertionError: expected:<1> but was:<0>
	at org.eclipse.jdt.core.groovy.tests.search.ConstructorReferenceSearchTests.testConstructorReferences13(ConstructorReferenceSearchTests.java:349)
Collapse Failed ConstructorReferenceSearchTests testConstructorReferences8 History
Default Job < 1 sec
java.lang.AssertionError: expected:<1> but was:<0>
	at org.eclipse.jdt.core.groovy.tests.search.ConstructorReferenceSearchTests.testConstructorReferences8(ConstructorReferenceSearchTests.java:218)
Collapse Failed ConstructorReferenceSearchTests testConstructorReferences12 History
Default Job < 1 sec
java.lang.AssertionError: expected:<2> but was:<0>
	at org.eclipse.jdt.core.groovy.tests.search.ConstructorReferenceSearchTests.testConstructorReferences12(ConstructorReferenceSearchTests.java:313)
Collapse Failed ConstructorReferenceSearchTests testConstructorReferences11 History
Default Job < 1 sec
java.lang.AssertionError: expected:<2> but was:<0>
	at org.eclipse.jdt.core.groovy.tests.search.ConstructorReferenceSearchTests.testConstructorReferences11(ConstructorReferenceSearchTests.java:276)
Existing test failures 1
Status Test Failing since View job Duration
junit.framework.ComparisonFailure: 
----------- Expected ------------

------------ but was ------------
Problem : The import util.MyException is never used [ resource : </Project/src/p/Test.java> range : <18,34> category : <120> severity : <1>]

--------- Difference is ----------
 expected:<[]> but was:<[Problem : The import util.MyException is never used [ resource : </Project/src/p/Test.java> range : <18,34> category : <120> severity : <1>]
(12 more lines...)
Fixed tests 6
Status Test Failing since View job Duration
Successful BinarySearchTests testClassDecl1 History
Failing since build #504 (Changes by Eric Milles) Default Job 1 sec
Successful ClosureInferencingTests testWithAndClosure1 History
Failing since build #504 (Changes by Eric Milles) Default Job < 1 sec
Successful ConstructorReferenceSearchTests testConstructorReferences10 History
Failing since build #504 (Changes by Eric Milles) Default Job < 1 sec
Successful ConstructorReferenceSearchTests testConstructorReferences1 History
Failing since build #504 (Changes by Eric Milles) Default Job < 1 sec
Successful DGMInferencingTests testDGMClosure15 History
Failing since build #504 (Changes by Eric Milles) Default Job < 1 sec
Successful TypeReferenceSearchTests testFindClassDeclarationWithPattern History
Failing since build #504 (Changes by Eric Milles) Default Job 1 sec
Skipped tests 100
Status Test Failing since View job
Skipped ConstructorCompletionTests testNamedArgumentTrigger2 History
Default Job
Skipped DefaultGroovyMethodCompletionTests testDateGM History
Default Job
Skipped MethodCompletionTests testMethodPointer4a History
Default Job
Skipped MethodCompletionTests testMethodPointer2a History
Default Job
Skipped MethodCompletionTests testMethodPointer3a History
Default Job
Skipped MethodCompletionTests testMethodPointer1a History
Default Job
Skipped RelevanceTests testNewMethodThenModifier History
Default Job
Skipped CodeSelectKeywordsTests testCodeSelectKeywordDef4 History
Default Job
Skipped CodeSelectKeywordsTests testCodeSelectKeywordDef5 History
Default Job
Skipped CodeSelectTypesTests testSelectPackageOnFullyQualifiedName7b History
Default Job
Skipped CodeSelectTypesTests testSelectPackageOnFullyQualifiedName7 History
Default Job
Skipped CodeSelectTypesTests testSelectPackageOnFullyQualifiedName7a History
Default Job
Skipped BuiltInDSLInferencingTests testSwingBuilder2 History
Default Job
Skipped BuiltInDSLInferencingTests testSwingBuilder1 History
Default Job
Skipped DSLContentAssistTests testSwingBuilder3 History
Default Job
Skipped DSLContentAssistTests testSwingBuilder2 History
Default Job
Skipped DSLContentAssistTests testSwingBuilder1 History
Default Job
Skipped MoveCURefactoringTests testInnerMove3 History
Default Job
Skipped MoveCURefactoringTests testInnerMove4 History
Default Job
Skipped MoveCURefactoringTests testInnerMove1 History
Default Job
Skipped MoveCURefactoringTests testInnerMove2 History
Default Job
Skipped RenameMethodTests testEnumOverrides3 History
Default Job
Skipped RenameMethodTests testDelegate2 History
Default Job
Skipped RenameMethodTests testDelegate1 History
Default Job
Skipped ExpressionFinderTests testNoExpression1 History
Default Job
Skipped ExpressionFinderTests testComplex4 History
Default Job
Skipped GroovyScriptLaunchShortcutTests testScriptLaunch11 History
Default Job
Skipped SemanticHighlightingTests testVarKeyword7 History
Default Job
Skipped SemanticHighlightingTests testVarKeyword4 History
Default Job
Skipped SemanticHighlightingTests testVarKeyword5 History
Default Job
Skipped SemanticHighlightingTests testVarKeyword6 History
Default Job
Skipped SemanticHighlightingTests testAnnoElems2 History
Default Job
Skipped SemanticHighlightingTests testMethodReference History
Default Job
Skipped SemanticHighlightingTests testForParams2 History
Default Job
Skipped SemanticHighlightingTests testForParams3 History
Default Job
Skipped SemanticHighlightingTests testForParams1 History
Default Job
Skipped SemanticHighlightingTests testTailCallMethods History
Default Job
Skipped SemanticHighlightingTests testVarKeyword3 History
Default Job
Skipped BasicGroovyBuildTests testSpock_GRE605_1 History
Default Job
Skipped BasicGroovyBuildTests testSpock_GRE558 History
Default Job
Skipped BasicGroovyBuildTests testSpock_GRE605_2 History
Default Job
Skipped SourceLocationsTests testErrorPositionForUnsupportedOperation History
Default Job
Skipped SourceLocationsTests testSourceLocationsTrailingWhitespace1 History
Default Job
Skipped SourceLocationsTests testSourceLocationsTrailingWhitespace2 History
Default Job
Skipped GroovyPartialModelTests testFieldInitializerIsAvailable4 History
Default Job
Skipped GroovyPartialModelTests testFieldInitializerIsAvailable3 History
Default Job
Skipped DGMInferencingTests testDGSMDeclaring1 History
Default Job
Skipped DGMInferencingTests testDGM43 History
Default Job
Skipped DGMInferencingTests testDGM45a History
Default Job
Skipped GenericInferencingTests testStaticMethod8 History
Default Job
Skipped GenericInferencingTests testJira1718 History
Default Job
Skipped Groovy25InferencingTests org.eclipse.jdt.core.groovy.tests.search.Groovy25InferencingTests History
Default Job
Skipped InferencingTests testGetAt9 History
Default Job
Skipped InferencingTests testInstanceOf10a History
Default Job
Skipped InferencingTests testInstanceOf2a History
Default Job
Skipped InferencingTests testGetAt8 History
Default Job
Skipped InferencingTests testInstanceOf3a History
Default Job
Skipped MethodReferenceSearchTests testOverloadedMethodReferences5a History
Default Job
Skipped MethodReferenceSearchTests testMethodWithDefaultParameters4 History
Default Job
Skipped SpockInferencingTests testEqualsCheck History
Default Job
Skipped SpockInferencingTests testDataTableChecks History
Default Job
Skipped SpockInferencingTests testGetterCheck History
Default Job
Skipped SpockInferencingTests testBasics History
Default Job
Skipped SpockInferencingTests testPropertyCheck History
Default Job
Skipped StaticInferencingTests testStaticImport13 History
Default Job
Skipped StaticInferencingTests testStaticImport14 History
Default Job
Skipped StaticInferencingTests testStaticImport15 History
Default Job
Skipped AnnotationsTests testFloatLiteralAttributeDefault2a[Java 1.7] History
Default Job
Skipped AnnotationsTests testFloatLiteralAttributeDefault2a[Java 1.8] History
Default Job
Skipped AnnotationsTests testCharLiteralAttributeValue[Java 1.8] History
Default Job
Skipped AnnotationsTests testFloatLiteralAttributeDefault2[Java 1.8] History
Default Job
Skipped AnnotationsTests testCharLiteralAttributeValue[Java 1.7] History
Default Job
Skipped AnnotationsTests testLongLiteralAttributeDefault2[Java 1.8] History
Default Job
Skipped AnnotationsTests testFloatLiteralAttributeDefault2[Java 1.7] History
Default Job
Skipped AnnotationsTests testDoubleLiteralAttributeDefault2a[Java 1.8] History
Default Job
Skipped AnnotationsTests testDoubleLiteralAttributeDefault2[Java 1.8] History
Default Job
Skipped AnnotationsTests testDoubleLiteralAttributeDefault2a[Java 1.7] History
Default Job
Skipped AnnotationsTests testLongLiteralAttributeDefault2a[Java 1.8] History
Default Job
Skipped AnnotationsTests testDoubleLiteralAttributeDefault2[Java 1.7] History
Default Job
Skipped AnnotationsTests testLongLiteralAttributeDefault2[Java 1.7] History
Default Job
Skipped AnnotationsTests testLongLiteralAttributeDefault2a[Java 1.7] History
Default Job
Skipped GenericsTests testGenericsPositions_6_GRE267[Java 1.7] History
Default Job
Skipped GenericsTests testJava7_2[Java 1.8] History
Default Job
Skipped GenericsTests testExtendingGenerics_GroovyExtendsJava07[Java 1.8] History
Default Job
Skipped GenericsTests testExtendingGenerics_GroovyExtendsJava08[Java 1.8] History
Default Job
Skipped GenericsTests testJava7_2[Java 1.7] History
Default Job
Skipped GenericsTests testExtendingGenerics_GroovyExtendsJava06[Java 1.8] History
Default Job
Skipped GenericsTests testGenericsPositions_6_GRE267[Java 1.8] History
Default Job
Skipped GroovySimpleTests testMultiCatch0[Java 1.8] History
Default Job
Skipped GroovySimpleTests testMultiCatch0[Java 1.7] History
Default Job
Skipped Java8Tests testNonRepeatableAnnotation[Java 1.7] History
Default Job
Skipped Java8Tests testRepeatableAnnotation1[Java 1.7] History
Default Job
Skipped Java8Tests testDefaultAndStaticMethodInInterface[Java 1.7] History
Default Job
Skipped Java8Tests testRepeatableAnnotation3[Java 1.7] History
Default Job
Skipped Java8Tests testFunctionalInterfaceCoercion[Java 1.7] History
Default Job
Skipped Java8Tests testRepeatableAnnotation2[Java 1.7] History
Default Job
Skipped TraitsTests testTraits51[Java 1.7] History
Default Job
Skipped TraitsTests testTraits51[Java 1.8] History
Default Job
Skipped CanonicalTests testCanonical1[Java 1.8] History
Default Job
Skipped CanonicalTests testCanonical1[Java 1.7] History
Default Job