Build: #523 failed Changes by Eric Milles

Build result summary

Details

Completed
Duration
95 minutes
Labels
None
Agent
bamboo-23.af.pivotal.io
Revision
1780c16c2593ecdbf3d2cbcce3335e9b6f0a29e2 1780c16c2593ecdbf3d2cbcce3335e9b6f0a29e2
Total tests
6184
Failing since
#448 (Changes by Eric Milles)

Responsible

Code commits

Author Commit Message Commit date
Eric Milles Eric Milles 1780c16c2593ecdbf3d2cbcce3335e9b6f0a29e2 1780c16c2593ecdbf3d2cbcce3335e9b6f0a29e2 Fix for #959: check aliased annotations for attribute methods

Configuration changes

Plan configuration has changed since the last successful build. See the plan audit log for more details.

Tests

New test failures 2
Status Test View job Duration
Collapse Failed DGMInferencingTests testDGM25 History
Default Job < 1 sec
java.lang.AssertionError: Expected type not found.
Expected: java.math.BigDecimal
Found: java.lang.Object
Declaring type: Search
ASTNode: org.codehaus.groovy.ast.Parameter@ee271[name:seed type: java.lang.Object, hasDefaultValue: false]
Confidence: EXACT

java.lang.AssertionError: 
(9 more lines...)
Collapse Failed DGMInferencingTests testDGSMDeclaring5 History
Default Job < 1 sec
java.lang.AssertionError: Expected declaring type not found.
 Expected: org.codehaus.groovy.runtime.DefaultGroovyStaticMethods
 Found type: java.lang.String
 Found declaring type: java.util.regex.Matcher
 ASTNode: org.codehaus.groovy.ast.expr.ConstantExpression@ee9ff[getLastMatcher]
java.lang.AssertionError: 
Expected declaring type not found.
	Expected: org.codehaus.groovy.runtime.DefaultGroovyStaticMethods
(5 more lines...)
Existing test failures 1
Status Test Failing since View job Duration
junit.framework.ComparisonFailure: 
----------- Expected ------------

------------ but was ------------
Problem : The import util.MyException is never used [ resource : </Project/src/p/Test.java> range : <18,34> category : <120> severity : <1>]

--------- Difference is ----------
 expected:<[]> but was:<[Problem : The import util.MyException is never used [ resource : </Project/src/p/Test.java> range : <18,34> category : <120> severity : <1>]
(12 more lines...)
Fixed tests 1
Status Test Failing since View job Duration
Successful BasicGroovyBuildTests testInners_983 History
Failing since build #522 (Changes by Eric Milles) Default Job < 1 sec