Build: #529 failed Changes by Eric Milles

Build result summary

Details

Completed
Duration
94 minutes
Labels
None
Agent
bamboo-18.af.pivotal.io
Revision
fa80d42e631db1c8971b1d724531910312b73bc7 fa80d42e631db1c8971b1d724531910312b73bc7
Total tests
6189
Fixed in
#577 (Changes by Eric Milles)

Responsible

Code commits

Author Commit Message Commit date
Eric Milles Eric Milles fa80d42e631db1c8971b1d724531910312b73bc7 fa80d42e631db1c8971b1d724531910312b73bc7 fix test case
#999

Tests

New test failures 11
Status Test View job Duration
Collapse Failed BasicGroovyBuildTests testCompileStatic2 History
Default Job < 1 sec
org.junit.ComparisonFailure: unexpected recompiled units. lenExpected=1 lenActual=2 expected:<{A[]}> but was:<{A[,A]}>
	at org.eclipse.jdt.core.groovy.tests.builder.BasicGroovyBuildTests.testCompileStatic2(BasicGroovyBuildTests.java:406)
Collapse Failed ArrayInferencingTests testArrayProperty4 History
Default Job < 1 sec
java.lang.AssertionError: Expected type not found.
Expected: XX
Found: java.lang.String
Declaring type: XX[]
ASTNode: org.codehaus.groovy.ast.expr.ConstantExpression@ec821[yy]
Confidence: UNKNOWN

java.lang.AssertionError: 
(8 more lines...)
Collapse Failed BinarySearchTests testFieldDecl1 History
Default Job 1 sec
java.lang.AssertionError: Expecting 2 matches, but found 0

java.lang.AssertionError: 
Expecting 2 matches, but found 0

	at org.eclipse.jdt.core.groovy.tests.search.BinarySearchTests.assertMatches(BinarySearchTests.java:139)
	at org.eclipse.jdt.core.groovy.tests.search.BinarySearchTests.testFieldDecl1(BinarySearchTests.java:181)
Collapse Failed ClosureInferencingTests testNestedClosure6 History
Default Job < 1 sec
java.lang.AssertionError: Expected type not found.
Expected: java.lang.Integer
Found: java.lang.Object
Declaring type: groovy.lang.Closure
ASTNode: org.codehaus.groovy.ast.expr.ConstantExpression@f87c8[abs]
Confidence: UNKNOWN

java.lang.AssertionError: 
(8 more lines...)
Collapse Failed ConstructorReferenceSearchTests testConstructorReferences4 History
Default Job < 1 sec
java.lang.AssertionError: expected:<2> but was:<0>
	at org.eclipse.jdt.core.groovy.tests.search.ConstructorReferenceSearchTests.testConstructorReferences4(ConstructorReferenceSearchTests.java:144)
Collapse Failed ConstructorReferenceSearchTests testConstructorReferences6 History
Default Job < 1 sec
java.lang.AssertionError: expected:<2> but was:<0>
	at org.eclipse.jdt.core.groovy.tests.search.ConstructorReferenceSearchTests.testConstructorReferences6(ConstructorReferenceSearchTests.java:180)
Collapse Failed ConstructorReferenceSearchTests testConstructorReferences11a History
Default Job < 1 sec
java.lang.AssertionError: expected:<3> but was:<0>
	at org.eclipse.jdt.core.groovy.tests.search.ConstructorReferenceSearchTests.testConstructorReferences11a(ConstructorReferenceSearchTests.java:295)
Collapse Failed ConstructorReferenceSearchTests testConstructorReferences7 History
Default Job < 1 sec
java.lang.AssertionError: expected:<1> but was:<0>
	at org.eclipse.jdt.core.groovy.tests.search.ConstructorReferenceSearchTests.testConstructorReferences7(ConstructorReferenceSearchTests.java:198)
Collapse Failed DGMInferencingTests testDGM17 History
Default Job < 1 sec
java.lang.AssertionError: Expected type not found.
Expected: java.lang.Integer
Found: java.lang.Object
Declaring type: Search
ASTNode: org.codehaus.groovy.ast.expr.VariableExpression@f6236[variable: value]
Confidence: INFERRED

java.lang.AssertionError: 
(9 more lines...)
Collapse Failed MethodReferenceSearchTests testExplicitPropertySetterSearch1 History
Default Job < 1 sec
java.lang.AssertionError: expected:<5> but was:<0>
	at org.eclipse.jdt.core.groovy.tests.search.MethodReferenceSearchTests.testExplicitPropertySetterSearch1(MethodReferenceSearchTests.java:623)
Collapse Failed TypeReferenceSearchTests testFindClassDeclarationWithPattern History
Default Job 1 sec
java.lang.AssertionError: Number of results found expected:<2> but was:<0>
	at org.eclipse.jdt.core.groovy.tests.search.TypeReferenceSearchTests.testFindClassDeclarationWithPattern(TypeReferenceSearchTests.java:220)
Existing test failures 1
Status Test Failing since View job Duration
junit.framework.ComparisonFailure: 
----------- Expected ------------

------------ but was ------------
Problem : The import util.MyException is never used [ resource : </Project/src/p/Test.java> range : <18,34> category : <120> severity : <1>]

--------- Difference is ----------
 expected:<[]> but was:<[Problem : The import util.MyException is never used [ resource : </Project/src/p/Test.java> range : <18,34> category : <120> severity : <1>]
(12 more lines...)
Fixed tests 1
Status Test Failing since View job Duration
Successful OutlineExtenderTests testOutlineTreeConsistency2 History
Default Job 1 sec