Build: #531 failed Changes by Eric Milles

Build result summary

Details

Completed
Duration
95 minutes
Labels
None
Agent
bamboo-16.af.pivotal.io
Revision
163e5a14977f2adc0e9c180a97f149fda5ee1a64 163e5a14977f2adc0e9c180a97f149fda5ee1a64
Total tests
6189
Failing since
#529 (Changes by Eric Milles)
Fixed in
#577 (Changes by Eric Milles)

Responsible

Code commits

Author Commit Message Commit date
Eric Milles Eric Milles 163e5a14977f2adc0e9c180a97f149fda5ee1a64 163e5a14977f2adc0e9c180a97f149fda5ee1a64 fix compatibility with Groovy 2.4 batch compiler
#998

Tests

New test failures 2
Status Test View job Duration
Collapse Failed BasicGroovyBuildTests testProjectBasedirAsOutputLocation History
Default Job < 1 sec
org.junit.ComparisonFailure: unexpected recompiled units. lenExpected=1 lenActual=2 expected:<{p.Script[]}> but was:<{p.Script[,p.Script]}>
	at org.eclipse.jdt.core.groovy.tests.builder.BasicGroovyBuildTests.testProjectBasedirAsOutputLocation(BasicGroovyBuildTests.java:274)
Collapse Failed ConstructorReferenceSearchTests testConstructorReferences3 History
Default Job < 1 sec
java.lang.AssertionError: expected:<3> but was:<0>
	at org.eclipse.jdt.core.groovy.tests.search.ConstructorReferenceSearchTests.testConstructorReferences3(ConstructorReferenceSearchTests.java:126)
Existing test failures 2
Status Test Failing since View job Duration
junit.framework.ComparisonFailure: 
----------- Expected ------------

------------ but was ------------
Problem : The import util.MyException is never used [ resource : </Project/src/p/Test.java> range : <18,34> category : <120> severity : <1>]

--------- Difference is ----------
 expected:<[]> but was:<[Problem : The import util.MyException is never used [ resource : </Project/src/p/Test.java> range : <18,34> category : <120> severity : <1>]
(12 more lines...)
java.lang.AssertionError: Expected but not found: SongTests (not open) [in SongTests.groovy [in gtunes [in src [in Project]]]]
Expected but not found: ArtistTests (not open) [in ArtistTests.groovy [in gtunes [in src [in Project]]]]
Found but not expected: class ArtistTests [in ArtistTests.groovy [in src.gtunes [in <project root> [in Project]]]]
  java.lang.Object testSomething()
Found but not expected: class SongTests [in SongTests.groovy [in src.gtunes [in <project root> [in Project]]]]
  java.lang.Object testSomething()

java.lang.AssertionError: 
(9 more lines...)
Fixed tests 10
Status Test Failing since View job Duration
Successful BasicGroovyBuildTests testCompileStatic2 History
Failing since build #529 (Changes by Eric Milles) Default Job < 1 sec
Successful ArrayInferencingTests testArrayProperty4 History
Failing since build #529 (Changes by Eric Milles) Default Job < 1 sec
Successful BinarySearchTests testFieldDecl1 History
Failing since build #529 (Changes by Eric Milles) Default Job 1 sec
Successful ClosureInferencingTests testNestedClosure6 History
Failing since build #529 (Changes by Eric Milles) Default Job < 1 sec
Successful ConstructorReferenceSearchTests testConstructorReferences11a History
Failing since build #529 (Changes by Eric Milles) Default Job < 1 sec
Successful ConstructorReferenceSearchTests testConstructorReferences6 History
Failing since build #529 (Changes by Eric Milles) Default Job < 1 sec
Successful ConstructorReferenceSearchTests testConstructorReferences7 History
Failing since build #529 (Changes by Eric Milles) Default Job < 1 sec
Successful ConstructorReferenceSearchTests testConstructorReferences4 History
Failing since build #529 (Changes by Eric Milles) Default Job < 1 sec
Successful DGMInferencingTests testDGM17 History
Failing since build #529 (Changes by Eric Milles) Default Job < 1 sec
Successful MethodReferenceSearchTests testExplicitPropertySetterSearch1 History
Failing since build #529 (Changes by Eric Milles) Default Job < 1 sec