Build: #537 failed Changes by Eric Milles

Build result summary

Details

Completed
Duration
96 minutes
Labels
None
Agent
bamboo-18.af.pivotal.io
Revision
1ef40a50b45133a2dc99ceb1c4b699a2d4cebae1 1ef40a50b45133a2dc99ceb1c4b699a2d4cebae1
Total tests
6210
Failing since
#529 (Changes by Eric Milles)
Fixed in
#577 (Changes by Eric Milles)

Responsible

Code commits

Author Commit Message Commit date
Eric Milles Eric Milles 1ef40a50b45133a2dc99ceb1c4b699a2d4cebae1 1ef40a50b45133a2dc99ceb1c4b699a2d4cebae1 Fix configuration of lower-bounded wildcard types (i.e. Foo<? super T>)

Tests

New test failures 2
Status Test View job Duration
Collapse Failed BinarySearchTests testClassDecl2 History
Default Job 1 sec
java.lang.AssertionError: Expecting 4 matches, but found 0

java.lang.AssertionError: 
Expecting 4 matches, but found 0

	at org.eclipse.jdt.core.groovy.tests.search.BinarySearchTests.assertMatches(BinarySearchTests.java:139)
	at org.eclipse.jdt.core.groovy.tests.search.BinarySearchTests.testClassDecl2(BinarySearchTests.java:172)
Collapse Failed ConstructorReferenceSearchTests testConstructorReferences7 History
Default Job < 1 sec
java.lang.AssertionError: expected:<1> but was:<0>
	at org.eclipse.jdt.core.groovy.tests.search.ConstructorReferenceSearchTests.testConstructorReferences7(ConstructorReferenceSearchTests.java:198)
Existing test failures 1
Status Test Failing since View job Duration
junit.framework.ComparisonFailure: 
----------- Expected ------------

------------ but was ------------
Problem : The import util.MyException is never used [ resource : </Project/src/p/Test.java> range : <18,34> category : <120> severity : <1>]

--------- Difference is ----------
 expected:<[]> but was:<[Problem : The import util.MyException is never used [ resource : </Project/src/p/Test.java> range : <18,34> category : <120> severity : <1>]
(12 more lines...)
Fixed tests 1
Status Test Failing since View job Duration
Successful BuildAccessRulesTests testAccessForMethodParameter History
Failing since build #536 (Changes by Eric Milles) Default Job < 1 sec