Build: #567 failed Changes by Eric Milles

Build result summary

Details

Completed
Duration
97 minutes
Labels
None
Agent
bamboo-17.af.pivotal.io
Revision
c73fca8f7f1595a01fcaa6b189ba0536572d674f c73fca8f7f1595a01fcaa6b189ba0536572d674f
Total tests
6284
Failing since
#529 (Changes by Eric Milles)

Responsible

Code commits

Author Commit Message Commit date
Eric Milles Eric Milles c73fca8f7f1595a01fcaa6b189ba0536572d674f c73fca8f7f1595a01fcaa6b189ba0536572d674f Fix for #1020: set zero name length for script's type declaration
Eric Milles Eric Milles 53f889314d8948e9784350310e680dbb37f28d4d 53f889314d8948e9784350310e680dbb37f28d4d Fix for #1019: improve accuracy of searches for simple method references

Tests

New test failures 3
Status Test View job Duration
Collapse Failed BinarySearchTests testClassDecl2 History
Default Job 1 sec
java.lang.AssertionError: Expecting 4 matches, but found 0

java.lang.AssertionError: 
Expecting 4 matches, but found 0

	at org.eclipse.jdt.core.groovy.tests.search.BinarySearchTests.assertMatches(BinarySearchTests.java:139)
	at org.eclipse.jdt.core.groovy.tests.search.BinarySearchTests.testClassDecl2(BinarySearchTests.java:172)
Collapse Failed ConstructorReferenceSearchTests testConstructorReferences3 History
Default Job < 1 sec
java.lang.AssertionError: expected:<3> but was:<0>
	at org.eclipse.jdt.core.groovy.tests.search.ConstructorReferenceSearchTests.testConstructorReferences3(ConstructorReferenceSearchTests.java:126)
Collapse Failed MethodReferenceSearchTests testGenericsMethodReferenceSearch History
Default Job < 1 sec
java.lang.AssertionError: expected:<1> but was:<0>
	at org.eclipse.jdt.core.groovy.tests.search.MethodReferenceSearchTests.testGenericsMethodReferenceSearch(MethodReferenceSearchTests.java:772)
Existing test failures 1
Status Test Failing since View job Duration
junit.framework.ComparisonFailure: 
----------- Expected ------------

------------ but was ------------
Problem : The import util.MyException is never used [ resource : </Project/src/p/Test.java> range : <18,34> category : <120> severity : <1>]

--------- Difference is ----------
 expected:<[]> but was:<[Problem : The import util.MyException is never used [ resource : </Project/src/p/Test.java> range : <18,34> category : <120> severity : <1>]
(12 more lines...)
Fixed tests 24
Status Test Failing since View job Duration
Successful RenameFieldTests test14 History
Failing since build #566 (Changes by Eric Milles) Default Job 1 sec
Successful RenameFieldTests testInitializer2 History
Failing since build #566 (Changes by Eric Milles) Default Job 1 sec
Successful RenameFieldTests testInitializer3 History
Failing since build #566 (Changes by Eric Milles) Default Job 1 sec
Successful RenameFieldTests test11 History
Failing since build #566 (Changes by Eric Milles) Default Job 1 sec
Successful RenameFieldTests test10 History
Failing since build #566 (Changes by Eric Milles) Default Job 4 secs
Successful RenameFieldTests test13 History
Failing since build #566 (Changes by Eric Milles) Default Job 1 sec
Successful RenameFieldTests test15 History
Failing since build #566 (Changes by Eric Milles) Default Job 1 sec
Successful RenameFieldTests test9 History
Failing since build #566 (Changes by Eric Milles) Default Job 1 sec
Successful RenameFieldTests test7 History
Failing since build #566 (Changes by Eric Milles) Default Job 1 sec
Successful RenameFieldTests test8 History
Failing since build #566 (Changes by Eric Milles) Default Job 1 sec
Successful RenameFieldTests test2 History
Failing since build #566 (Changes by Eric Milles) Default Job 1 sec
Successful RenameFieldTests test5 History
Failing since build #566 (Changes by Eric Milles) Default Job 1 sec
Successful RenameFieldTests test6 History
Failing since build #566 (Changes by Eric Milles) Default Job 1 sec
Successful RenameFieldTests test3 History
Failing since build #566 (Changes by Eric Milles) Default Job 1 sec
Successful RenameFieldTests test4 History
Failing since build #566 (Changes by Eric Milles) Default Job 1 sec
Successful RenameFieldTests testScript2 History
Failing since build #566 (Changes by Eric Milles) Default Job 1 sec
Successful RenameFieldTests testScript1 History
Failing since build #566 (Changes by Eric Milles) Default Job 1 sec
Successful RenameFieldTests testInitializer1 History
Failing since build #566 (Changes by Eric Milles) Default Job 1 sec
Successful BuildAccessRulesTests testAccessForPropertyGenerics History
Failing since build #566 (Changes by Eric Milles) Default Job < 1 sec
Successful ArrayInferencingTests testArrayProperty5 History
Failing since build #566 (Changes by Eric Milles) Default Job < 1 sec
Successful ConstructorReferenceSearchTests testConstructorReferences8 History
Failing since build #566 (Changes by Eric Milles) Default Job < 1 sec
Successful ConstructorReferenceSearchTests testConstructorReferences11a History
Failing since build #566 (Changes by Eric Milles) Default Job < 1 sec
Successful MethodReferenceSearchTests testExplicitPropertySetterSearch2 History
Failing since build #566 (Changes by Eric Milles) Default Job < 1 sec
Successful MethodReferenceSearchTests testExplicitPropertyGetterSearch2 History
Failing since build #566 (Changes by Eric Milles) Default Job < 1 sec