Build: #330 failed

Job: Default Job failed

Stages & jobs

  1. Default Stage

Job result summary

Completed
Duration
265 minutes
Agent
bamboo-16.af.pivotal.io
Revision
25675391e1a5e9af708e1dd2c785ae420a83c645 25675391e1a5e9af708e1dd2c785ae420a83c645
Total tests
5727
Failing since
#325 (Code changes detected – )
Fixed in
#347 (Code changes detected)

Tests

  • 5,727 tests in total
  • 6 tests failed
  • 3 failures are new
  • 102 tests were quarantined / skipped
  • 99 minutes taken in total.
New test failures 3
Status Test Duration
Collapse Failed BuildAccessRulesTests testAccessForMethodReturnType History
< 1 sec
junit.framework.ComparisonFailure: 
----------- Expected ------------
Problem : Access restriction: The type 'BeanInfo' is not API (restriction on required library '##') [ resource : </Project/src/Foo.groovy> range : <34,42> category : <150> severity : <2>]

------------ but was ------------

--------- Difference is ----------
 expected:<[Problem : Access restriction: The type 'BeanInfo' is not API (restriction on required library '##') [ resource : </Project/src/Foo.groovy> range : <34,42> category : <150> severity : <2>]
(13 more lines...)
Collapse Failed DGMInferencingTests testDGM46 History
< 1 sec
java.lang.AssertionError: Expected type not found.
Expected: java.util.regex.Pattern[]
Found: java.lang.String
Declaring type: java.util.regex.Pattern[]
ASTNode: org.codehaus.groovy.ast.expr.ConstantExpression@f1716[eachWithIndex]
Confidence: UNKNOWN

java.lang.AssertionError: 
(9 more lines...)
Collapse Failed GenericInferencingTests testMap15 History
< 1 sec
java.lang.NoClassDefFoundError: org/codehaus/groovy/runtime/DefaultGroovyMethodsSupport
	at org.eclipse.jdt.core.groovy.tests.search.GenericInferencingTests.testMap15(GenericInferencingTests.java:370)
Caused by: java.lang.ClassNotFoundException: org.codehaus.groovy.runtime.DefaultGroovyMethodsSupport
	at org.eclipse.jdt.core.groovy.tests.search.GenericInferencingTests.testMap15(GenericInferencingTests.java:370)
Existing test failures 3
Status Test Failing since Duration
org.junit.ComparisonFailure: unexpected recompiled units. lenExpected=3 lenActual=4 expected:<...st.Class1,test.Class[]2,test.Class3}> but was:<...st.Class1,test.Class[1,test.Class]2,test.Class3}>
	at org.eclipse.jdt.core.groovy.tests.builder.BasicGroovyBuildTests.testGRE1773(BasicGroovyBuildTests.java:3422)
org.junit.runners.model.TestTimedOutException: test timed out after 1500 milliseconds
	at org.eclipse.jdt.groovy.core.tests.basic.EnumerationTests.testEnum4438(EnumerationTests.java:316)
org.junit.runners.model.TestTimedOutException: test timed out after 1500 milliseconds
	at org.eclipse.jdt.groovy.core.tests.basic.EnumerationTests.testEnum4438(EnumerationTests.java:316)

Error summary

The build generated some errors. See the full build log for more details.

INFO: I/O exception (java.net.SocketException) caught when processing request to {}->http://www.eclipse.org:80: Connection reset
May 25, 2019 1:26:17 PM org.apache.http.impl.client.DefaultRequestDirector tryExecute
INFO: Retrying request to {}->http://www.eclipse.org:80
May 25, 2019 1:26:17 PM org.apache.http.impl.client.DefaultRequestDirector tryExecute
INFO: I/O exception (java.net.SocketException) caught when processing request to {}->http://www.eclipse.org:80: Connection reset
May 25, 2019 1:26:17 PM org.apache.http.impl.client.DefaultRequestDirector tryExecute
INFO: Retrying request to {}->http://www.eclipse.org:80
May 25, 2019 1:26:20 PM org.apache.http.impl.client.DefaultRequestDirector tryExecute
INFO: I/O exception (java.net.SocketException) caught when processing request to {}->http://www.eclipse.org:80: Connection reset
May 25, 2019 1:26:20 PM org.apache.http.impl.client.DefaultRequestDirector tryExecute
INFO: Retrying request to {}->http://www.eclipse.org:80
May 25, 2019 1:26:20 PM org.apache.http.impl.client.DefaultRequestDirector tryExecute
INFO: I/O exception (java.net.SocketException) caught when processing request to {}->http://www.eclipse.org:80: Connection reset
May 25, 2019 1:26:20 PM org.apache.http.impl.client.DefaultRequestDirector tryExecute
INFO: Retrying request to {}->http://www.eclipse.org:80
May 25, 2019 1:26:21 PM org.apache.http.impl.client.DefaultRequestDirector tryExecute
INFO: I/O exception (java.net.SocketException) caught when processing request to {}->http://www.eclipse.org:80: Connection reset
May 25, 2019 1:26:21 PM org.apache.http.impl.client.DefaultRequestDirector tryExecute
INFO: Retrying request to {}->http://www.eclipse.org:80
May 25, 2019 1:26:21 PM org.apache.http.impl.client.DefaultRequestDirector tryExecute
INFO: I/O exception (java.net.SocketException) caught when processing request to {}->http://www.eclipse.org:80: Connection reset
May 25, 2019 1:26:21 PM org.apache.http.impl.client.DefaultRequestDirector tryExecute
INFO: Retrying request to {}->http://www.eclipse.org:80
May 25, 2019 1:26:22 PM org.apache.http.impl.client.DefaultRequestDirector tryExecute
INFO: I/O exception (java.net.SocketException) caught when processing request to {}->http://www.eclipse.org:80: Connection reset
May 25, 2019 1:26:22 PM org.apache.http.impl.client.DefaultRequestDirector tryExecute
INFO: Retrying request to {}->http://www.eclipse.org:80
May 25, 2019 1:26:22 PM org.apache.http.impl.client.DefaultRequestDirector tryExecute
INFO: I/O exception (java.net.SocketException) caught when processing request to {}->http://www.eclipse.org:80: Connection reset
May 25, 2019 1:26:22 PM org.apache.http.impl.client.DefaultRequestDirector tryExecute
INFO: Retrying request to {}->http://www.eclipse.org:80

(SWT:27317): Gtk-WARNING **: 13:26:27.051: gtk_widget_size_allocate(): attempt to allocate widget with width -3 and height -3

(SWT:27317): Gtk-CRITICAL **: 13:26:29.570: gtk_box_gadget_distribute: assertion 'size >= 0' failed in GtkScrollbar
TypeInferencingVisitorWithRequestor.findMethodNode: no match found for Foo(QMap.Entry;, Qjava.lang.Object;)
TypeInferencingVisitorWithRequestor.findMethodNode: no match found for Foo(QMap.Entry;)
TypeInferencingVisitorWithRequestor.findMethodNode: no match found for Foo(QDictionary;)
TypeInferencingVisitorWithRequestor.findMethodNode: no match found for TestUnit589250.y(QOuter.Inner;)
TypeInferencingVisitorWithRequestor.findMethodNode: no match found for TestUnit589250.y(QOuter.Inner;)
TypeInferencingVisitorWithRequestor.findMethodNode: no match found for TestUnit523676.y(QOuter.Inner;)
TypeInferencingVisitorWithRequestor.findMethodNode: no match found for TestUnit523676.y(QOuter.Inner;)
TypeInferencingVisitorWithRequestor.findMethodNode: no match found for Main.main([Qjava.lang.String;)
TypeInferencingVisitorWithRequestor.findMethodNode: no match found for Main.main([Qjava.lang.String;)
CodeSelectRequestor: Could not proceed due to null declaring type for org.codehaus.groovy.ast.expr.BinaryExpression@ecbea[org.codehaus.groovy.ast.expr.VariableExpression@ecbe3[variable: it]("in" at 1:20:  "in" )org.codehaus.groovy.ast.expr.ListExpression@ee270[]]
CodeSelectRequestor: Could not proceed due to null declaring type for org.codehaus.groovy.ast.expr.RangeExpression@ebcdd
CodeSelectRequestor: Could not proceed due to null declaring type for org.codehaus.groovy.ast.expr.RangeExpression@ebcde
Exception in thread "org.eclipse.jdt.internal.ui.text.JavaReconciler" java.lang.NoClassDefFoundError: Unable to load class org.codehaus.groovy.runtime.StringGroovyMethods due to missing dependency groovy/lang/GString
        at org.codehaus.groovy.vmplugin.v5.Java5.configureClassNode(Java5.java:426)
        at org.codehaus.groovy.ast.ClassNode.lazyClassInit(ClassNode.java:354)
        at org.codehaus.groovy.ast.ClassNode.getDeclaredMethods(ClassNode.java:1012)
        at org.codehaus.groovy.ast.ClassNode.getMethods(ClassNode.java:1026)
        at org.eclipse.jdt.groovy.search.CategoryTypeLookup.lookupType(CategoryTypeLookup.java:65)
        at org.eclipse.jdt.groovy.search.TypeInferencingVisitorWithRequestor.lookupExpressionType(TypeInferencingVisitorWithRequestor.java:2429)
        at org.eclipse.jdt.groovy.search.TypeInferencingVisitorWithRequestor.getMethodCallArgumentTypes(TypeInferencingVisitorWithRequestor.java:2107)
        at org.eclipse.jdt.groovy.search.TypeInferencingVisitorWithRequestor.handleSimpleExpression(TypeInferencingVisitorWithRequestor.java:1844)
        at org.eclipse.jdt.groovy.search.TypeInferencingVisitorWithRequestor.handleSimpleExpression(TypeInferencingVisitorWithRequestor.java:1855)
        at org.eclipse.jdt.groovy.search.TypeInferencingVisitorWithRequestor.visitConstantExpression(TypeInferencingVisitorWithRequestor.java:966)
        at org.codehaus.groovy.ast.expr.ConstantExpression.visit(ConstantExpression.java:83)
        at org.eclipse.jdt.groovy.search.TypeInferencingVisitorWithRequestor.visitMethodCallExpression(TypeInferencingVisitorWithRequestor.java:1412)
        at org.codehaus.groovy.ast.expr.MethodCallExpression.visit(MethodCallExpression.java:68)
        at org.codehaus.groovy.ast.CodeVisitorSupport.visitExpressionStatement(CodeVisitorSupport.java:119)
        at org.codehaus.groovy.ast.ClassCodeVisitorSupport.visitExpressionStatement(ClassCodeVisitorSupport.java:283)
        at org.codehaus.groovy.ast.stmt.ExpressionStatement.visit(ExpressionStatement.java:40)
        at org.codehaus.groovy.ast.ClassCodeVisitorSupport.visitClassCodeContainer(ClassCodeVisitorSupport.java:160)
        at org.eclipse.jdt.groovy.search.TypeInferencingVisitorWithRequestor.visitConstructorOrMethod(TypeInferencingVisitorWithRequestor.java:1061)
        at org.eclipse.jdt.groovy.search.TypeInferencingVisitorWithRequestor.visitMethodInternal(TypeInferencingVisitorWithRequestor.java:621)
        at org.eclipse.jdt.groovy.search.TypeInferencingVisitorWithRequestor.visitJDT(TypeInferencingVisitorWithRequestor.java:455)
        at org.eclipse.jdt.groovy.search.TypeInferencingVisitorWithRequestor.visitJDT(TypeInferencingVisitorWithRequestor.java:346)
        at org.eclipse.jdt.groovy.search.TypeInferencingVisitorWithRequestor.visitCompilationUnit(TypeInferencingVisitorWithRequestor.java:252)
        at org.codehaus.groovy.eclipse.editor.highlighting.GatherSemanticReferences.findSemanticHighlightingReferences(GatherSemanticReferences.java:45)
        at org.codehaus.groovy.eclipse.editor.highlighting.GroovySemanticReconciler.reconciled(GroovySemanticReconciler.java:246)
        at org.eclipse.jdt.internal.ui.javaeditor.CompilationUnitEditor.reconciled(CompilationUnitEditor.java:1693)
        at org.eclipse.jdt.internal.ui.text.java.JavaReconcilingStrategy.reconciled(JavaReconcilingStrategy.java:222)
        at org.eclipse.jdt.internal.ui.text.JavaCompositeReconcilingStrategy.reconciled(JavaCompositeReconcilingStrategy.java:167)
        at org.eclipse.jdt.internal.ui.text.JavaCompositeReconcilingStrategy.initialReconcile(JavaCompositeReconcilingStrategy.java:147)
        at org.eclipse.jface.text.reconciler.MonoReconciler.initialProcess(MonoReconciler.java:98)
        at org.eclipse.jdt.internal.ui.text.JavaReconciler.initialProcess(JavaReconciler.java:423)
        at org.eclipse.jface.text.reconciler.AbstractReconciler$BackgroundThread.run(AbstractReconciler.java:177)
TypeInferencingVisitorWithRequestor.findMethodNode: no match found for Type.x(QList<Qjava.util.Date;>;)
TypeInferencingVisitorWithRequestor.findMethodNode: no match found for Type.x(QList<Qjava.lang.Number;>;)
TypeInferencingVisitorWithRequestor.findMethodNode: no match found for Type.x(QList<Qjava.util.Date;>;)
TypeInferencingVisitorWithRequestor.findMethodNode: no match found for Type.x(QList<Qjava.lang.Number;>;)
CodeSelectRequestor: Could not proceed due to null declaring type for org.codehaus.groovy.ast.expr.ConstantExpression@e8fc6[fff]
CodeSelectRequestor: Could not proceed due to null declaring type for org.codehaus.groovy.ast.expr.ConstantExpression@e8fca[fff]
CodeSelectRequestor: Could not proceed due to null declaring type for org.codehaus.groovy.ast.expr.ConstantExpression@e8fca[fff]
Waiting for: Java indexing... 22 files to index (/Project)
Waiting for: Java indexing... 22 files to index (/Project)
Waiting for: Java indexing... 22 files to index (/Project)
Waiting for: Java indexing... 22 files to index (/Project)
Waiting for: Java indexing... 22 files to index (/Project)
Waiting for: Java indexing... 22 files to index (/Project)
Waiting for: Java indexing... 22 files to index (/Project)
Waiting for: Java indexing... 21 files to index (/Project)
Waiting for: Flushing content description cache.
Waiting for: Java indexing... 21 files to index (/Project)
Waiting for: Flushing content description cache.
Waiting for: Java indexing... 20 files to index (/Project)
Waiting for: Java indexing... 17 files to index (/opt/jdk8u212-b03/jre/lib/ext/zipfs.jar)
Force Stop build feature is enabled for current plan. Either Bamboo has detected the build has hung or it has been manually stopped.