Build: #331 failed

Job: Default Job failed

Stages & jobs

  1. Default Stage

Job result summary

Completed
Duration
104 minutes
Agent
bamboo-16.af.pivotal.io
Revision
d8d53d2497ae77f8afad2a6905ecb033cc6171d1 d8d53d2497ae77f8afad2a6905ecb033cc6171d1
Total tests
5729
Failing since
#325 (Code changes detected – )
Fixed in
#347 (Code changes detected)

Tests

  • 5,729 tests in total
  • 7 tests failed
  • 4 failures are new
  • 3 tests were fixed
  • 102 tests were quarantined / skipped
  • 99 minutes taken in total.
New test failures 4
Status Test Duration
Collapse Failed GroovyCompilationUnitTests testSingleMemberAnnotation1 History
< 1 sec
java.lang.RuntimeException: Java Model Exception: Java Model Status [Build path contains duplicate entry: 'org.eclipse.jdt.launching.JRE_CONTAINER' for project 'Project']
	at org.eclipse.jdt.core.groovy.tests.model.GroovyCompilationUnitTests.testSingleMemberAnnotation1(GroovyCompilationUnitTests.java:431)
Caused by: org.eclipse.jdt.core.JavaModelException: Build path contains duplicate entry: 'org.eclipse.jdt.launching.JRE_CONTAINER' for project 'Project'
	at org.eclipse.jdt.core.groovy.tests.model.GroovyCompilationUnitTests.testSingleMemberAnnotation1(GroovyCompilationUnitTests.java:431)
Collapse Failed GroovyCompilationUnitTests testVariadicMethod1 History
< 1 sec
java.lang.RuntimeException: Java Model Exception: Java Model Status [Build path contains duplicate entry: 'org.eclipse.jdt.launching.JRE_CONTAINER' for project 'Project']
	at org.eclipse.jdt.core.groovy.tests.model.GroovyCompilationUnitTests.testVariadicMethod1(GroovyCompilationUnitTests.java:771)
Caused by: org.eclipse.jdt.core.JavaModelException: Build path contains duplicate entry: 'org.eclipse.jdt.launching.JRE_CONTAINER' for project 'Project'
	at org.eclipse.jdt.core.groovy.tests.model.GroovyCompilationUnitTests.testVariadicMethod1(GroovyCompilationUnitTests.java:771)
Collapse Failed ClosureInferencingTests testNestedClosure16 History
< 1 sec
java.lang.AssertionError: Expected type not found.
Expected: java.lang.Boolean
Found: java.lang.Object
Declaring type: groovy.lang.Closure
ASTNode: org.codehaus.groovy.ast.expr.ConstantExpression@12c643[meth]
Confidence: UNKNOWN

java.lang.AssertionError: 
(8 more lines...)
Collapse Failed Groovy21InferencingTests testTypeCheckingExtension History
< 1 sec
java.lang.AssertionError: Expected type not found.
Expected: java.lang.Void
Found: java.lang.String
Declaring type: java.lang.Object
ASTNode: org.codehaus.groovy.ast.expr.ConstantExpression@11704d[move]
Confidence: UNKNOWN

java.lang.AssertionError: 
(8 more lines...)
Existing test failures 3
Status Test Failing since Duration
org.junit.ComparisonFailure: unexpected recompiled units. lenExpected=3 lenActual=4 expected:<...st.Class1,test.Class[]2,test.Class3}> but was:<...st.Class1,test.Class[1,test.Class]2,test.Class3}>
	at org.eclipse.jdt.core.groovy.tests.builder.BasicGroovyBuildTests.testGRE1773(BasicGroovyBuildTests.java:3422)
org.junit.runners.model.TestTimedOutException: test timed out after 1500 milliseconds
	at org.eclipse.jdt.groovy.core.tests.basic.EnumerationTests.testEnum4438(EnumerationTests.java:316)
org.junit.runners.model.TestTimedOutException: test timed out after 1500 milliseconds
	at org.eclipse.jdt.groovy.core.tests.basic.EnumerationTests.testEnum4438(EnumerationTests.java:316)
Fixed tests 3
Status Test Failing since Duration
Successful BuildAccessRulesTests testAccessForMethodReturnType History
Failing since build #330 (Code changes detected) < 1 sec
Successful DGMInferencingTests testDGM46 History
Failing since build #330 (Code changes detected) < 1 sec
Successful GenericInferencingTests testMap15 History
Failing since build #330 (Code changes detected) < 1 sec

Error summary

The build generated some errors. See the full build log for more details.


(SWT:1613): Gtk-CRITICAL **: 17:17:17.485: gtk_box_gadget_distribute: assertion 'size >= 0' failed in GtkScrollbar
TypeInferencingVisitorWithRequestor.findMethodNode: no match found for Foo(QMap.Entry;, Qjava.lang.Object;)
TypeInferencingVisitorWithRequestor.findMethodNode: no match found for Foo(QMap.Entry;)
TypeInferencingVisitorWithRequestor.findMethodNode: no match found for Foo(QDictionary;)
TypeInferencingVisitorWithRequestor.findMethodNode: no match found for TestUnit337041.y(QOuter.Inner;)
TypeInferencingVisitorWithRequestor.findMethodNode: no match found for TestUnit337041.y(QOuter.Inner;)
TypeInferencingVisitorWithRequestor.findMethodNode: no match found for TestUnit233896.y(QOuter.Inner;)
TypeInferencingVisitorWithRequestor.findMethodNode: no match found for TestUnit233896.y(QOuter.Inner;)
TypeInferencingVisitorWithRequestor.findMethodNode: no match found for Main.main([Qjava.lang.String;)
TypeInferencingVisitorWithRequestor.findMethodNode: no match found for Main.main([Qjava.lang.String;)
CodeSelectRequestor: Could not proceed due to null declaring type for org.codehaus.groovy.ast.expr.BinaryExpression@ecbea[org.codehaus.groovy.ast.expr.VariableExpression@ecbe3[variable: it]("in" at 1:20:  "in" )org.codehaus.groovy.ast.expr.ListExpression@ee270[]]
CodeSelectRequestor: Could not proceed due to null declaring type for org.codehaus.groovy.ast.expr.RangeExpression@ebcdd
CodeSelectRequestor: Could not proceed due to null declaring type for org.codehaus.groovy.ast.expr.RangeExpression@ebcde
TypeInferencingVisitorWithRequestor.findMethodNode: no match found for Type.x(QList<Qjava.util.Date;>;)
TypeInferencingVisitorWithRequestor.findMethodNode: no match found for Type.x(QList<Qjava.lang.Number;>;)
TypeInferencingVisitorWithRequestor.findMethodNode: no match found for Type.x(QList<Qjava.lang.Number;>;)
TypeInferencingVisitorWithRequestor.findMethodNode: no match found for Type.x(QList<Qjava.util.Date;>;)
TypeInferencingVisitorWithRequestor.findMethodNode: no match found for Type.x(QList<Qjava.lang.Number;>;)
CodeSelectRequestor: Could not proceed due to null declaring type for org.codehaus.groovy.ast.expr.ConstantExpression@e8fc6[fff]
CodeSelectRequestor: Could not proceed due to null declaring type for org.codehaus.groovy.ast.expr.ConstantExpression@e8fca[fff]
CodeSelectRequestor: Could not proceed due to null declaring type for org.codehaus.groovy.ast.expr.ConstantExpression@e8fca[fff]
Waiting for: Java indexing... 17 files to index (/opt/jdk8u212-b03/jre/lib/rt.jar)
Waiting for: Java indexing... 22 files to index (/Project)
Waiting for: Java indexing... 22 files to index (/Project)
Waiting for: Java indexing... 22 files to index (/Project)
Waiting for: Java indexing... 22 files to index (/Project)
Waiting for: Java indexing... 22 files to index (/Project)
Waiting for: Java indexing... 22 files to index (/Project)
Waiting for: Java indexing... 21 files to index (/Project)
Waiting for: Java indexing... 21 files to index (/Project)
Waiting for: Flushing content description cache.
Waiting for: Java indexing... 21 files to index (/Project)
Waiting for: Java indexing... 19 files to index (/opt/jdk8u212-b03/jre/lib/rt.jar)