Build: #331 failed

Job: Default Job failed

Stages & jobs

  1. Default Stage

Test results

  • 5,729 tests in total
  • 7 tests failed
  • 4 failures are new
  • 3 tests were fixed
  • 102 tests were quarantined / skipped
  • 99 minutes taken in total.

Build 331 has the following 7 errors: 4 new failure(s) occurred since the previous build.

New test failures 4
Status Test Duration
Collapse Failed GroovyCompilationUnitTests testSingleMemberAnnotation1 History
< 1 sec
java.lang.RuntimeException: Java Model Exception: Java Model Status [Build path contains duplicate entry: 'org.eclipse.jdt.launching.JRE_CONTAINER' for project 'Project']
	at org.eclipse.jdt.core.groovy.tests.model.GroovyCompilationUnitTests.testSingleMemberAnnotation1(GroovyCompilationUnitTests.java:431)
Caused by: org.eclipse.jdt.core.JavaModelException: Build path contains duplicate entry: 'org.eclipse.jdt.launching.JRE_CONTAINER' for project 'Project'
	at org.eclipse.jdt.core.groovy.tests.model.GroovyCompilationUnitTests.testSingleMemberAnnotation1(GroovyCompilationUnitTests.java:431)
Collapse Failed GroovyCompilationUnitTests testVariadicMethod1 History
< 1 sec
java.lang.RuntimeException: Java Model Exception: Java Model Status [Build path contains duplicate entry: 'org.eclipse.jdt.launching.JRE_CONTAINER' for project 'Project']
	at org.eclipse.jdt.core.groovy.tests.model.GroovyCompilationUnitTests.testVariadicMethod1(GroovyCompilationUnitTests.java:771)
Caused by: org.eclipse.jdt.core.JavaModelException: Build path contains duplicate entry: 'org.eclipse.jdt.launching.JRE_CONTAINER' for project 'Project'
	at org.eclipse.jdt.core.groovy.tests.model.GroovyCompilationUnitTests.testVariadicMethod1(GroovyCompilationUnitTests.java:771)
Collapse Failed ClosureInferencingTests testNestedClosure16 History
< 1 sec
java.lang.AssertionError: Expected type not found.
Expected: java.lang.Boolean
Found: java.lang.Object
Declaring type: groovy.lang.Closure
ASTNode: org.codehaus.groovy.ast.expr.ConstantExpression@12c643[meth]
Confidence: UNKNOWN

java.lang.AssertionError: 
(8 more lines...)
Collapse Failed Groovy21InferencingTests testTypeCheckingExtension History
< 1 sec
java.lang.AssertionError: Expected type not found.
Expected: java.lang.Void
Found: java.lang.String
Declaring type: java.lang.Object
ASTNode: org.codehaus.groovy.ast.expr.ConstantExpression@11704d[move]
Confidence: UNKNOWN

java.lang.AssertionError: 
(8 more lines...)
Existing test failures 3
Status Test Failing since Duration
org.junit.ComparisonFailure: unexpected recompiled units. lenExpected=3 lenActual=4 expected:<...st.Class1,test.Class[]2,test.Class3}> but was:<...st.Class1,test.Class[1,test.Class]2,test.Class3}>
	at org.eclipse.jdt.core.groovy.tests.builder.BasicGroovyBuildTests.testGRE1773(BasicGroovyBuildTests.java:3422)
org.junit.runners.model.TestTimedOutException: test timed out after 1500 milliseconds
	at org.eclipse.jdt.groovy.core.tests.basic.EnumerationTests.testEnum4438(EnumerationTests.java:316)
org.junit.runners.model.TestTimedOutException: test timed out after 1500 milliseconds
	at org.eclipse.jdt.groovy.core.tests.basic.EnumerationTests.testEnum4438(EnumerationTests.java:316)