Build: #331 failed

Job: Default Job failed

Stages & jobs

  1. Default Stage

Variadic method1: Test case result

The below summarizes the result of the test "Variadic method1" in build 331 of Groovy-Eclipse - Eclipse 2018-09 build and publish - Default Job. View test case history
Description
Variadic method1
Test class
org.eclipse.jdt.core.groovy.tests.model.GroovyCompilationUnitTests
Method
testVariadicMethod1
Duration
< 1 sec
Status
Failed (New Failure)

Error Log

java.lang.RuntimeException: Java Model Exception: Java Model Status [Build path contains duplicate entry: 'org.eclipse.jdt.launching.JRE_CONTAINER' for project 'Project']
	at org.eclipse.jdt.core.groovy.tests.model.GroovyCompilationUnitTests.testVariadicMethod1(GroovyCompilationUnitTests.java:771)
Caused by: org.eclipse.jdt.core.JavaModelException: Build path contains duplicate entry: 'org.eclipse.jdt.launching.JRE_CONTAINER' for project 'Project'
	at org.eclipse.jdt.core.groovy.tests.model.GroovyCompilationUnitTests.testVariadicMethod1(GroovyCompilationUnitTests.java:771)