Build: #333 failed

Job: Default Job failed

Stages & jobs

  1. Default Stage

Job result summary

Completed
Duration
265 minutes
Agent
bamboo-24.af.pivotal.io
Revision
2d0cbc1836f31ab60f94a13d20325522a24315af 2d0cbc1836f31ab60f94a13d20325522a24315af
Total tests
5731
Failing since
#325 (Code changes detected – )
Fixed in
#347 (Code changes detected)

Tests

  • 5,731 tests in total
  • 4 tests failed
  • 1 failure is new
  • 4 tests were fixed
  • 102 tests were quarantined / skipped
  • 100 minutes taken in total.
New test failures 1
Status Test Duration
Collapse Failed InferencingTests testNumber5 History
< 1 sec
java.lang.NoClassDefFoundError: org/codehaus/groovy/runtime/DefaultGroovyMethodsSupport
	at org.eclipse.jdt.core.groovy.tests.search.InferencingTests.testNumber5(InferencingTests.java:65)
Caused by: java.lang.ClassNotFoundException: org.codehaus.groovy.runtime.DefaultGroovyMethodsSupport
	at org.eclipse.jdt.core.groovy.tests.search.InferencingTests.testNumber5(InferencingTests.java:65)
Existing test failures 3
Status Test Failing since Duration
org.junit.ComparisonFailure: unexpected recompiled units. lenExpected=3 lenActual=4 expected:<...st.Class1,test.Class[]2,test.Class3}> but was:<...st.Class1,test.Class[1,test.Class]2,test.Class3}>
	at org.eclipse.jdt.core.groovy.tests.builder.BasicGroovyBuildTests.testGRE1773(BasicGroovyBuildTests.java:3422)
org.junit.runners.model.TestTimedOutException: test timed out after 1500 milliseconds
	at org.eclipse.jdt.groovy.core.tests.basic.EnumerationTests.testEnum4438(EnumerationTests.java:316)
org.junit.runners.model.TestTimedOutException: test timed out after 1500 milliseconds
	at org.eclipse.jdt.groovy.core.tests.basic.EnumerationTests.testEnum4438(EnumerationTests.java:316)
Fixed tests 4
Status Test Failing since Duration
Successful GroovyCompilationUnitTests testSingleMemberAnnotation1 History
Failing since build #331 (Code changes detected) < 1 sec
Successful GroovyCompilationUnitTests testVariadicMethod1 History
Failing since build #331 (Code changes detected) < 1 sec
Successful ClosureInferencingTests testNestedClosure16 History
Failing since build #331 (Code changes detected) < 1 sec
Successful Groovy21InferencingTests testTypeCheckingExtension History
Failing since build #331 (Code changes detected) < 1 sec

Error summary

The build generated some errors. See the full build log for more details.

May 27, 2019 1:16:02 PM org.apache.http.impl.client.DefaultRequestDirector tryExecute
INFO: Retrying request to {}->http://www.eclipse.org:80
May 27, 2019 1:16:03 PM org.apache.http.impl.client.DefaultRequestDirector tryExecute
INFO: I/O exception (java.net.SocketException) caught when processing request to {}->http://www.eclipse.org:80: Connection reset
May 27, 2019 1:16:03 PM org.apache.http.impl.client.DefaultRequestDirector tryExecute
INFO: Retrying request to {}->http://www.eclipse.org:80
May 27, 2019 1:16:03 PM org.apache.http.impl.client.DefaultRequestDirector tryExecute
INFO: I/O exception (java.net.SocketException) caught when processing request to {}->http://www.eclipse.org:80: Connection reset
May 27, 2019 1:16:03 PM org.apache.http.impl.client.DefaultRequestDirector tryExecute
INFO: Retrying request to {}->http://www.eclipse.org:80
May 27, 2019 1:16:04 PM org.apache.http.impl.client.DefaultRequestDirector tryExecute
INFO: I/O exception (java.net.SocketException) caught when processing request to {}->http://www.eclipse.org:80: Connection reset
May 27, 2019 1:16:04 PM org.apache.http.impl.client.DefaultRequestDirector tryExecute
INFO: Retrying request to {}->http://www.eclipse.org:80
May 27, 2019 1:16:04 PM org.apache.http.impl.client.DefaultRequestDirector tryExecute
INFO: I/O exception (java.net.SocketException) caught when processing request to {}->http://www.eclipse.org:80: Connection reset
May 27, 2019 1:16:04 PM org.apache.http.impl.client.DefaultRequestDirector tryExecute
INFO: Retrying request to {}->http://www.eclipse.org:80
May 27, 2019 1:16:06 PM org.apache.http.impl.client.DefaultRequestDirector tryExecute
INFO: I/O exception (java.net.SocketException) caught when processing request to {}->http://www.eclipse.org:80: Connection reset
May 27, 2019 1:16:06 PM org.apache.http.impl.client.DefaultRequestDirector tryExecute
INFO: Retrying request to {}->http://www.eclipse.org:80
May 27, 2019 1:16:06 PM org.apache.http.impl.client.DefaultRequestDirector tryExecute
INFO: I/O exception (java.net.SocketException) caught when processing request to {}->http://www.eclipse.org:80: Connection reset
May 27, 2019 1:16:06 PM org.apache.http.impl.client.DefaultRequestDirector tryExecute
INFO: Retrying request to {}->http://www.eclipse.org:80
May 27, 2019 1:16:06 PM org.apache.http.impl.client.DefaultRequestDirector tryExecute
INFO: I/O exception (java.net.SocketException) caught when processing request to {}->http://www.eclipse.org:80: Connection reset
May 27, 2019 1:16:06 PM org.apache.http.impl.client.DefaultRequestDirector tryExecute
INFO: Retrying request to {}->http://www.eclipse.org:80
May 27, 2019 1:16:07 PM org.apache.http.impl.client.DefaultRequestDirector tryExecute
INFO: I/O exception (java.net.SocketException) caught when processing request to {}->http://www.eclipse.org:80: Connection reset
May 27, 2019 1:16:07 PM org.apache.http.impl.client.DefaultRequestDirector tryExecute
INFO: Retrying request to {}->http://www.eclipse.org:80
May 27, 2019 1:16:07 PM org.apache.http.impl.client.DefaultRequestDirector tryExecute
INFO: I/O exception (java.net.SocketException) caught when processing request to {}->http://www.eclipse.org:80: Connection reset
May 27, 2019 1:16:07 PM org.apache.http.impl.client.DefaultRequestDirector tryExecute
INFO: Retrying request to {}->http://www.eclipse.org:80
May 27, 2019 1:16:07 PM org.apache.http.impl.client.DefaultRequestDirector tryExecute
INFO: I/O exception (java.net.SocketException) caught when processing request to {}->http://www.eclipse.org:80: Connection reset
May 27, 2019 1:16:07 PM org.apache.http.impl.client.DefaultRequestDirector tryExecute
INFO: Retrying request to {}->http://www.eclipse.org:80
May 27, 2019 1:16:08 PM org.apache.http.impl.client.DefaultRequestDirector tryExecute
INFO: I/O exception (java.net.SocketException) caught when processing request to {}->http://www.eclipse.org:80: Connection reset
May 27, 2019 1:16:08 PM org.apache.http.impl.client.DefaultRequestDirector tryExecute
INFO: Retrying request to {}->http://www.eclipse.org:80
May 27, 2019 1:16:09 PM org.apache.http.impl.client.DefaultRequestDirector tryExecute
INFO: I/O exception (java.net.SocketException) caught when processing request to {}->http://www.eclipse.org:80: Connection reset
May 27, 2019 1:16:09 PM org.apache.http.impl.client.DefaultRequestDirector tryExecute
INFO: Retrying request to {}->http://www.eclipse.org:80
May 27, 2019 1:16:09 PM org.apache.http.impl.client.DefaultRequestDirector tryExecute
INFO: I/O exception (java.net.SocketException) caught when processing request to {}->http://www.eclipse.org:80: Connection reset
May 27, 2019 1:16:09 PM org.apache.http.impl.client.DefaultRequestDirector tryExecute
INFO: Retrying request to {}->http://www.eclipse.org:80
May 27, 2019 1:16:10 PM org.apache.http.impl.client.DefaultRequestDirector tryExecute
INFO: I/O exception (java.net.SocketException) caught when processing request to {}->http://www.eclipse.org:80: Connection reset
May 27, 2019 1:16:10 PM org.apache.http.impl.client.DefaultRequestDirector tryExecute
INFO: Retrying request to {}->http://www.eclipse.org:80
May 27, 2019 1:16:10 PM org.apache.http.impl.client.DefaultRequestDirector tryExecute
INFO: I/O exception (java.net.SocketException) caught when processing request to {}->http://www.eclipse.org:80: Connection reset
May 27, 2019 1:16:10 PM org.apache.http.impl.client.DefaultRequestDirector tryExecute
INFO: Retrying request to {}->http://www.eclipse.org:80
May 27, 2019 1:16:10 PM org.apache.http.impl.client.DefaultRequestDirector tryExecute
INFO: I/O exception (java.net.SocketException) caught when processing request to {}->http://www.eclipse.org:80: Connection reset
May 27, 2019 1:16:10 PM org.apache.http.impl.client.DefaultRequestDirector tryExecute
INFO: Retrying request to {}->http://www.eclipse.org:80

(SWT:22105): Gtk-CRITICAL **: 13:16:18.859: gtk_box_gadget_distribute: assertion 'size >= 0' failed in GtkScrollbar
TypeInferencingVisitorWithRequestor.findMethodNode: no match found for Foo(QMap.Entry;, Qjava.lang.Object;)
TypeInferencingVisitorWithRequestor.findMethodNode: no match found for Foo(QMap.Entry;)
TypeInferencingVisitorWithRequestor.findMethodNode: no match found for Foo(QDictionary;)
TypeInferencingVisitorWithRequestor.findMethodNode: no match found for TestUnit413661.y(QOuter.Inner;)
TypeInferencingVisitorWithRequestor.findMethodNode: no match found for TestUnit413661.y(QOuter.Inner;)
TypeInferencingVisitorWithRequestor.findMethodNode: no match found for TestUnit313412.y(QOuter.Inner;)
TypeInferencingVisitorWithRequestor.findMethodNode: no match found for TestUnit313412.y(QOuter.Inner;)
TypeInferencingVisitorWithRequestor.findMethodNode: no match found for Main.main([Qjava.lang.String;)
TypeInferencingVisitorWithRequestor.findMethodNode: no match found for Main.main([Qjava.lang.String;)
CodeSelectRequestor: Could not proceed due to null declaring type for org.codehaus.groovy.ast.expr.BinaryExpression@ecbea[org.codehaus.groovy.ast.expr.VariableExpression@ecbe3[variable: it]("in" at 1:20:  "in" )org.codehaus.groovy.ast.expr.ListExpression@ee270[]]
CodeSelectRequestor: Could not proceed due to null declaring type for org.codehaus.groovy.ast.expr.RangeExpression@ebcdd
CodeSelectRequestor: Could not proceed due to null declaring type for org.codehaus.groovy.ast.expr.RangeExpression@ebcde
TypeInferencingVisitorWithRequestor.findMethodNode: no match found for Type.x(QList<Qjava.util.Date;>;)
TypeInferencingVisitorWithRequestor.findMethodNode: no match found for Type.x(QList<Qjava.lang.Number;>;)
TypeInferencingVisitorWithRequestor.findMethodNode: no match found for Type.x(QList<Qjava.lang.Number;>;)
TypeInferencingVisitorWithRequestor.findMethodNode: no match found for Type.x(QList<Qjava.util.Date;>;)
TypeInferencingVisitorWithRequestor.findMethodNode: no match found for Type.x(QList<Qjava.lang.Number;>;)
CodeSelectRequestor: Could not proceed due to null declaring type for org.codehaus.groovy.ast.expr.ConstantExpression@e8fc6[fff]
CodeSelectRequestor: Could not proceed due to null declaring type for org.codehaus.groovy.ast.expr.ConstantExpression@e8fca[fff]
CodeSelectRequestor: Could not proceed due to null declaring type for org.codehaus.groovy.ast.expr.ConstantExpression@e8fca[fff]
Waiting for: Java indexing... 16 files to index (/opt/jdk8u212-b03/jre/lib/rt.jar)
Waiting for: Java indexing... 22 files to index (/Project)
Waiting for: Java indexing... 22 files to index (/Project)
Waiting for: Java indexing... 22 files to index (/Project)
Waiting for: Java indexing... 22 files to index (/Project)
Waiting for: Java indexing... 22 files to index (/Project)
Waiting for: Java indexing... 21 files to index (/Project)
Waiting for: Java indexing... 21 files to index (/Project)
Waiting for: Java indexing... 21 files to index (/Project)
Waiting for: Flushing content description cache.
Waiting for: Java indexing... 16 files to index (/opt/jdk8u212-b03/jre/lib/jsse.jar)
Force Stop build feature is enabled for current plan. Either Bamboo has detected the build has hung or it has been manually stopped.