Build: #400 failed

Job: Default Job failed

Stages & jobs

  1. Default Stage

Job result summary

Completed
Duration
109 minutes
Agent
bamboo-15.af.pivotal.io
Revision
102f4c0e2cbc04d2cfc58f908610c001335d95e0 102f4c0e2cbc04d2cfc58f908610c001335d95e0
Total tests
5955
Failing since
#399 (Code changes detected – )
Fixed in
#413 (Code changes detected)

Tests

  • 5,955 tests in total
  • 5 tests failed
  • 5 failures are new
  • 2 tests were fixed
  • 117 tests were quarantined / skipped
  • 104 minutes taken in total.
New test failures 5
Status Test Duration
Collapse Failed JUnit3TestFinderTests testFindAllTestSuites History
4 secs
java.lang.AssertionError: Should have found 3 test classes. Expression: (testTypes.size() == 3)
	at org.codehaus.groovy.eclipse.junit.test.JUnit3TestFinderTests.testFindAllTestSuites(JUnit3TestFinderTests.groovy:110)
Collapse Failed BasicGroovyBuildTests testInners_983 History
< 1 sec
org.junit.ComparisonFailure: unexpected recompiled units. lenExpected=3 lenActual=1 expected:<{Client[,Outer,Outer$Inner]}> but was:<{Client[]}>
	at org.eclipse.jdt.core.groovy.tests.builder.BasicGroovyBuildTests.testInners_983(BasicGroovyBuildTests.java:338)
Collapse Failed BasicGroovyBuildTests testSlow_GRE870 History
< 1 sec
org.junit.ComparisonFailure: unexpected recompiled units. lenExpected=2 lenActual=4 expected:<{Foo,[]Test1}> but was:<{Foo,[Foo,Test1,]Test1}>
	at org.eclipse.jdt.core.groovy.tests.builder.BasicGroovyBuildTests.testSlow_GRE870(BasicGroovyBuildTests.java:1646)
Collapse Failed BinarySearchTests testFieldDecl2 History
1 sec
java.lang.AssertionError: Expecting 2 matches, but found 0

java.lang.AssertionError: 
Expecting 2 matches, but found 0

	at org.eclipse.jdt.core.groovy.tests.search.BinarySearchTests.assertMatches(BinarySearchTests.java:135)
	at org.eclipse.jdt.core.groovy.tests.search.BinarySearchTests.testFieldDecl2(BinarySearchTests.java:186)
Collapse Failed BinarySearchTests testFieldRefInInitializer History
1 sec
java.lang.AssertionError: Expecting 1 matches, but found 0

java.lang.AssertionError: 
Expecting 1 matches, but found 0

	at org.eclipse.jdt.core.groovy.tests.search.BinarySearchTests.assertMatches(BinarySearchTests.java:135)
	at org.eclipse.jdt.core.groovy.tests.search.BinarySearchTests.testFieldRefInInitializer(BinarySearchTests.java:204)
Fixed tests 2
Status Test Failing since Duration
Successful BuildAccessRulesTests testAccessForMethodParameter History
Failing since build #399 (Code changes detected) < 1 sec
Successful BuildAccessRulesTests testAccessForMethodReturnTypeGenerics History
Failing since build #399 (Code changes detected) < 1 sec

Error summary

The build generated some errors. See the full build log for more details.


(SWT:24858): Gtk-WARNING **: 14:45:01.687: gtk_widget_size_allocate(): attempt to allocate widget with width -3 and height -3

(SWT:24858): Gtk-CRITICAL **: 14:45:04.923: gtk_box_gadget_distribute: assertion 'size >= 0' failed in GtkScrollbar
TypeInferencingVisitorWithRequestor.findMethodNode: no match found for Foo(QMap.Entry;, Qjava.lang.Object;)
TypeInferencingVisitorWithRequestor.findMethodNode: no match found for Foo(QMap.Entry;)
TypeInferencingVisitorWithRequestor.findMethodNode: no match found for TestUnit425334.y(QOuter.Inner;)
TypeInferencingVisitorWithRequestor.findMethodNode: no match found for TestUnit425334.y(QOuter.Inner;)
TypeInferencingVisitorWithRequestor.findMethodNode: no match found for TestUnit564406.y(QOuter.Inner;)
TypeInferencingVisitorWithRequestor.findMethodNode: no match found for TestUnit564406.y(QOuter.Inner;)
TypeInferencingVisitorWithRequestor.findMethodNode: no match found for Main.main([Qjava.lang.String;)
TypeInferencingVisitorWithRequestor.findMethodNode: no match found for Main.main([Qjava.lang.String;)
CodeSelectRequestor: Could not proceed due to null declaring type for org.codehaus.groovy.ast.expr.BinaryExpression@ecbea[org.codehaus.groovy.ast.expr.VariableExpression@ecbe3[variable: it]("in" at 1:20:  "in" )org.codehaus.groovy.ast.expr.ListExpression@ee270[]]
CodeSelectRequestor: Could not proceed due to null declaring type for org.codehaus.groovy.ast.expr.RangeExpression@ebcdd
CodeSelectRequestor: Could not proceed due to null declaring type for org.codehaus.groovy.ast.expr.RangeExpression@ebcde
TypeInferencingVisitorWithRequestor.findMethodNode: no match found for Type.x(QList<Qjava.util.Date;>;)
TypeInferencingVisitorWithRequestor.findMethodNode: no match found for Type.x(QList<Qjava.lang.Number;>;)
TypeInferencingVisitorWithRequestor.findMethodNode: no match found for Type.x(QList<Qjava.util.Date;>;)
TypeInferencingVisitorWithRequestor.findMethodNode: no match found for Type.x(QList<Qjava.lang.Number;>;)
CodeSelectRequestor: Could not proceed due to null declaring type for org.codehaus.groovy.ast.expr.ConstantExpression@e8fc6[fff]
CodeSelectRequestor: Could not proceed due to null declaring type for org.codehaus.groovy.ast.expr.ConstantExpression@e8fca[fff]
CodeSelectRequestor: Could not proceed due to null declaring type for org.codehaus.groovy.ast.expr.ConstantExpression@e8fca[fff]
Waiting for: Java indexing... 22 files to index (/Project)
Waiting for: Java indexing... 22 files to index (/Project)
Waiting for: Java indexing... 22 files to index (/Project)
Waiting for: Java indexing... 22 files to index (/Project)
Waiting for: Java indexing... 4 files to index (/opt/bamboo-home/xml-data/build-dir/GRECLIPSE-GE49-JOB1/ide-test/org.codehaus.groovy.alltests/target/work/plugins/org.eclipse.jdt.groovy.core.tests.builder_3.5.0.v201908021443-e1809/lib/binGroovySearch.jar)
Waiting for: Java indexing... 22 files to index (/Project)
Waiting for: Java indexing... 22 files to index (/Project)
Waiting for: Java indexing... 21 files to index (/Project)
Waiting for: Flushing content description cache.
Waiting for: Java indexing... 21 files to index (/Project)
Waiting for: Flushing content description cache.
Waiting for: Java indexing... 16 files to index (/opt/jdk8u212-b03/jre/lib/resources.jar)
Waiting for: Java indexing... 21 files to index (/Project)