Build: #400 failed

Job: Default Job failed

Stages & jobs

  1. Default Stage

Test results

  • 5,955 tests in total
  • 5 tests failed
  • 5 failures are new
  • 2 tests were fixed
  • 117 tests were quarantined / skipped
  • 104 minutes taken in total.

Build 400 has the following 5 errors: 5 new failure(s) occurred since the previous build.

New test failures 5
Status Test Duration
Collapse Failed JUnit3TestFinderTests testFindAllTestSuites History
4 secs
java.lang.AssertionError: Should have found 3 test classes. Expression: (testTypes.size() == 3)
	at org.codehaus.groovy.eclipse.junit.test.JUnit3TestFinderTests.testFindAllTestSuites(JUnit3TestFinderTests.groovy:110)
Collapse Failed BasicGroovyBuildTests testInners_983 History
< 1 sec
org.junit.ComparisonFailure: unexpected recompiled units. lenExpected=3 lenActual=1 expected:<{Client[,Outer,Outer$Inner]}> but was:<{Client[]}>
	at org.eclipse.jdt.core.groovy.tests.builder.BasicGroovyBuildTests.testInners_983(BasicGroovyBuildTests.java:338)
Collapse Failed BasicGroovyBuildTests testSlow_GRE870 History
< 1 sec
org.junit.ComparisonFailure: unexpected recompiled units. lenExpected=2 lenActual=4 expected:<{Foo,[]Test1}> but was:<{Foo,[Foo,Test1,]Test1}>
	at org.eclipse.jdt.core.groovy.tests.builder.BasicGroovyBuildTests.testSlow_GRE870(BasicGroovyBuildTests.java:1646)
Collapse Failed BinarySearchTests testFieldDecl2 History
1 sec
java.lang.AssertionError: Expecting 2 matches, but found 0

java.lang.AssertionError: 
Expecting 2 matches, but found 0

	at org.eclipse.jdt.core.groovy.tests.search.BinarySearchTests.assertMatches(BinarySearchTests.java:135)
	at org.eclipse.jdt.core.groovy.tests.search.BinarySearchTests.testFieldDecl2(BinarySearchTests.java:186)
Collapse Failed BinarySearchTests testFieldRefInInitializer History
1 sec
java.lang.AssertionError: Expecting 1 matches, but found 0

java.lang.AssertionError: 
Expecting 1 matches, but found 0

	at org.eclipse.jdt.core.groovy.tests.search.BinarySearchTests.assertMatches(BinarySearchTests.java:135)
	at org.eclipse.jdt.core.groovy.tests.search.BinarySearchTests.testFieldRefInInitializer(BinarySearchTests.java:204)