Build: #402 failed

Job: Default Job failed

Stages & jobs

  1. Default Stage

Job result summary

Completed
Duration
106 minutes
Agent
bamboo-17.af.pivotal.io
Revision
e8fb74bae17efc458b77f9b69cfd4777b504e587 e8fb74bae17efc458b77f9b69cfd4777b504e587
Total tests
5956
Failing since
#399 (Code changes detected – )
Fixed in
#413 (Code changes detected)

Tests

  • 5,956 tests in total
  • 5 tests failed
  • 5 failures are new
  • 2 tests were fixed
  • 117 tests were quarantined / skipped
  • 101 minutes taken in total.
New test failures 5
Status Test Duration
Collapse Failed BuildAccessRulesTests testAccessForFieldGenerics History
< 1 sec
junit.framework.ComparisonFailure: 
----------- Expected ------------
Problem : Access restriction: The type 'BeanInfo' is not API (restriction on required library '##') [ resource : </Project/src/Foo.groovy> range : <47,55> category : <150> severity : <2>]

------------ but was ------------

--------- Difference is ----------
 expected:<[Problem : Access restriction: The type 'BeanInfo' is not API (restriction on required library '##') [ resource : </Project/src/Foo.groovy> range : <47,55> category : <150> severity : <2>]
(13 more lines...)
Collapse Failed BuildAccessRulesTests testAccessForMethodReturnTypeGenerics History
< 1 sec
junit.framework.ComparisonFailure: 
----------- Expected ------------
Problem : Access restriction: The type 'BeanInfo' is not API (restriction on required library '##') [ resource : </Project/src/Foo.groovy> range : <39,47> category : <150> severity : <2>]

------------ but was ------------

--------- Difference is ----------
 expected:<[Problem : Access restriction: The type 'BeanInfo' is not API (restriction on required library '##') [ resource : </Project/src/Foo.groovy> range : <39,47> category : <150> severity : <2>]
(13 more lines...)
Collapse Failed ConstructorReferenceSearchTests testConstructorReferences12a History
< 1 sec
java.lang.AssertionError: expected:<3> but was:<0>
	at org.eclipse.jdt.core.groovy.tests.search.ConstructorReferenceSearchTests.testConstructorReferences12a(ConstructorReferenceSearchTests.java:332)
Collapse Failed MethodReferenceSearchTests testExplicitPropertySetterSearch2 History
< 1 sec
java.lang.AssertionError: expected:<5> but was:<0>
	at org.eclipse.jdt.core.groovy.tests.search.MethodReferenceSearchTests.testExplicitPropertySetterSearch2(MethodReferenceSearchTests.java:594)
Collapse Failed TypeReferenceSearchTests testFindClassDeclarationWithPattern History
1 sec
java.lang.AssertionError: Expected but not found: SongTests (not open) [in SongTests.groovy [in gtunes [in src [in Project]]]]
Expected but not found: ArtistTests (not open) [in ArtistTests.groovy [in gtunes [in src [in Project]]]]
Found but not expected: class ArtistTests [in ArtistTests.groovy [in src.gtunes [in <project root> [in Project]]]]
  java.lang.Object testSomething()
Found but not expected: class SongTests [in SongTests.groovy [in src.gtunes [in <project root> [in Project]]]]
  java.lang.Object testSomething()

java.lang.AssertionError: 
(9 more lines...)
Fixed tests 2
Status Test Failing since Duration
Successful BasicGroovyBuildTests testCompileStatic_BuildSettings History
Failing since build #401 (Code changes detected) < 1 sec
Successful BasicGroovyBuildTests testReallySlow_GRE870 History
Failing since build #401 (Code changes detected) < 1 sec

Error summary

The build generated some errors. See the full build log for more details.


(SWT:19144): Gtk-CRITICAL **: 00:38:46.514: gtk_box_gadget_distribute: assertion 'size >= 0' failed in GtkScrollbar
TypeInferencingVisitorWithRequestor.findMethodNode: no match found for Foo(QMap.Entry;, Qjava.lang.Object;)
TypeInferencingVisitorWithRequestor.findMethodNode: no match found for Foo(QMap.Entry;)
TypeInferencingVisitorWithRequestor.findMethodNode: no match found for TestUnit514462.y(QOuter.Inner;)
TypeInferencingVisitorWithRequestor.findMethodNode: no match found for TestUnit514462.y(QOuter.Inner;)
TypeInferencingVisitorWithRequestor.findMethodNode: no match found for TestUnit719990.y(QOuter.Inner;)
TypeInferencingVisitorWithRequestor.findMethodNode: no match found for TestUnit719990.y(QOuter.Inner;)
TypeInferencingVisitorWithRequestor.findMethodNode: no match found for Main.main([Qjava.lang.String;)
TypeInferencingVisitorWithRequestor.findMethodNode: no match found for Main.main([Qjava.lang.String;)
CodeSelectRequestor: Could not proceed due to null declaring type for org.codehaus.groovy.ast.expr.BinaryExpression@ecbea[org.codehaus.groovy.ast.expr.VariableExpression@ecbe3[variable: it]("in" at 1:20:  "in" )org.codehaus.groovy.ast.expr.ListExpression@ee270[]]
CodeSelectRequestor: Could not proceed due to null declaring type for org.codehaus.groovy.ast.expr.RangeExpression@ebcdd
CodeSelectRequestor: Could not proceed due to null declaring type for org.codehaus.groovy.ast.expr.RangeExpression@ebcde
TypeInferencingVisitorWithRequestor.findMethodNode: no match found for Type.x(QList<Qjava.util.Date;>;)
TypeInferencingVisitorWithRequestor.findMethodNode: no match found for Type.x(QList<Qjava.lang.Number;>;)
TypeInferencingVisitorWithRequestor.findMethodNode: no match found for Type.x(QList<Qjava.util.Date;>;)
TypeInferencingVisitorWithRequestor.findMethodNode: no match found for Type.x(QList<Qjava.lang.Number;>;)
CodeSelectRequestor: Could not proceed due to null declaring type for org.codehaus.groovy.ast.expr.ConstantExpression@e8fc6[fff]
CodeSelectRequestor: Could not proceed due to null declaring type for org.codehaus.groovy.ast.expr.ConstantExpression@e8fca[fff]
CodeSelectRequestor: Could not proceed due to null declaring type for org.codehaus.groovy.ast.expr.ConstantExpression@e8fca[fff]
Waiting for: Java indexing... 22 files to index (/Project)
Waiting for: Java indexing... 22 files to index (/Project)
Waiting for: Building workspace
Waiting for: Java indexing... 22 files to index (/Project)
Waiting for: Java indexing... 22 files to index (/Project)
Waiting for: Java indexing... 22 files to index (/Project)
Waiting for: Java indexing... 22 files to index (/Project)
Waiting for: Java indexing... 22 files to index (/Project)
Waiting for: Java indexing... 21 files to index (/Project)
Waiting for: Java indexing... 21 files to index (/Project)
Waiting for: Java indexing... 3 files to index (/Project)
Waiting for: Java indexing... 17 files to index (/opt/jdk8u212-b03/jre/lib/rt.jar)