Build: #403 failed

Job: Default Job failed

Stages & jobs

  1. Default Stage

Job result summary

Completed
Duration
108 minutes
Agent
bamboo-15.af.pivotal.io
Revision
d4cceccbbada29320ea71de728f56480e8cbe3af d4cceccbbada29320ea71de728f56480e8cbe3af
Total tests
5956
Failing since
#399 (Code changes detected – )
Fixed in
#413 (Code changes detected)

Tests

  • 5,956 tests in total
  • 3 tests failed
  • 3 failures are new
  • 5 tests were fixed
  • 117 tests were quarantined / skipped
  • 103 minutes taken in total.
New test failures 3
Status Test Duration
Collapse Failed BinarySearchTests testClassDecl1 History
1 sec
java.lang.AssertionError: Expecting 12 matches, but found 0

java.lang.AssertionError: 
Expecting 12 matches, but found 0

	at org.eclipse.jdt.core.groovy.tests.search.BinarySearchTests.assertMatches(BinarySearchTests.java:135)
	at org.eclipse.jdt.core.groovy.tests.search.BinarySearchTests.testClassDecl1(BinarySearchTests.java:161)
Collapse Failed ConstructorReferenceSearchTests testConstructorReferences4 History
< 1 sec
java.lang.AssertionError: expected:<2> but was:<0>
	at org.eclipse.jdt.core.groovy.tests.search.ConstructorReferenceSearchTests.testConstructorReferences4(ConstructorReferenceSearchTests.java:144)
Collapse Failed InferencingTests testSpread3 History
< 1 sec
java.lang.AssertionError: Expected type not found.
Expected: java.lang.Integer
Found: java.lang.String
Declaring type: java.util.List<java.lang.Integer>
ASTNode: org.codehaus.groovy.ast.expr.ConstantExpression@ee634[value]
Confidence: UNKNOWN

java.lang.AssertionError: 
(9 more lines...)
Fixed tests 5
Status Test Failing since Duration
Successful BuildAccessRulesTests testAccessForFieldGenerics History
Failing since build #402 (Code changes detected) < 1 sec
Successful BuildAccessRulesTests testAccessForMethodReturnTypeGenerics History
Failing since build #402 (Code changes detected) < 1 sec
Successful ConstructorReferenceSearchTests testConstructorReferences12a History
Failing since build #402 (Code changes detected) < 1 sec
Successful MethodReferenceSearchTests testExplicitPropertySetterSearch2 History
Failing since build #402 (Code changes detected) < 1 sec
Successful TypeReferenceSearchTests testFindClassDeclarationWithPattern History
Failing since build #402 (Code changes detected) < 1 sec

Error summary

The build generated some errors. See the full build log for more details.


(SWT:28130): Gtk-CRITICAL **: 12:39:05.951: gtk_box_gadget_distribute: assertion 'size >= 0' failed in GtkScrollbar
TypeInferencingVisitorWithRequestor.findMethodNode: no match found for Foo(QMap.Entry;, Qjava.lang.Object;)
TypeInferencingVisitorWithRequestor.findMethodNode: no match found for Foo(QMap.Entry;)
TypeInferencingVisitorWithRequestor.findMethodNode: no match found for TestUnit733230.y(QOuter.Inner;)
TypeInferencingVisitorWithRequestor.findMethodNode: no match found for TestUnit733230.y(QOuter.Inner;)
TypeInferencingVisitorWithRequestor.findMethodNode: no match found for TestUnit273417.y(QOuter.Inner;)
TypeInferencingVisitorWithRequestor.findMethodNode: no match found for TestUnit273417.y(QOuter.Inner;)
TypeInferencingVisitorWithRequestor.findMethodNode: no match found for Main.main([Qjava.lang.String;)
TypeInferencingVisitorWithRequestor.findMethodNode: no match found for Main.main([Qjava.lang.String;)
CodeSelectRequestor: Could not proceed due to null declaring type for org.codehaus.groovy.ast.expr.BinaryExpression@ecbea[org.codehaus.groovy.ast.expr.VariableExpression@ecbe3[variable: it]("in" at 1:20:  "in" )org.codehaus.groovy.ast.expr.ListExpression@ee270[]]
CodeSelectRequestor: Could not proceed due to null declaring type for org.codehaus.groovy.ast.expr.RangeExpression@ebcdd
CodeSelectRequestor: Could not proceed due to null declaring type for org.codehaus.groovy.ast.expr.RangeExpression@ebcde
TypeInferencingVisitorWithRequestor.findMethodNode: no match found for Type.x(QList<Qjava.util.Date;>;)
TypeInferencingVisitorWithRequestor.findMethodNode: no match found for Type.x(QList<Qjava.lang.Number;>;)
TypeInferencingVisitorWithRequestor.findMethodNode: no match found for Type.x(QList<Qjava.lang.Number;>;)
TypeInferencingVisitorWithRequestor.findMethodNode: no match found for Type.x(QList<Qjava.util.Date;>;)
TypeInferencingVisitorWithRequestor.findMethodNode: no match found for Type.x(QList<Qjava.lang.Number;>;)
CodeSelectRequestor: Could not proceed due to null declaring type for org.codehaus.groovy.ast.expr.ConstantExpression@e8fc6[fff]
CodeSelectRequestor: Could not proceed due to null declaring type for org.codehaus.groovy.ast.expr.ConstantExpression@e8fca[fff]
CodeSelectRequestor: Could not proceed due to null declaring type for org.codehaus.groovy.ast.expr.ConstantExpression@e8fca[fff]
Waiting for: Java indexing... 22 files to index (/Project)
Waiting for: Java indexing... 22 files to index (/Project)
Waiting for: Java indexing... 22 files to index (/Project)
Waiting for: Java indexing... 22 files to index (/Project)
Waiting for: Java indexing... 22 files to index (/Project)
Waiting for: Java indexing... 22 files to index (/Project)
Waiting for: Java indexing... 22 files to index (/Project)
Waiting for: Java indexing... 21 files to index (/Project)
Waiting for: Java indexing... 21 files to index (/Project)
Waiting for: Java indexing... 20 files to index (/Project)
Waiting for: Java indexing... 17 files to index (/opt/jdk8u212-b03/jre/lib/rt.jar)