Build: #462 failed

Job: Default Job failed

Stages & jobs

  1. Default Stage

Job result summary

Completed
Duration
91 minutes
Agent
bamboo-22.af.pivotal.io
Revision
b551656bad2833ee89b5f8a12cf281f4a39b5068 b551656bad2833ee89b5f8a12cf281f4a39b5068
Total tests
6050
Failing since
#448 (Code changes detected – )

Tests

  • 6,050 tests in total
  • 3 tests failed
  • 2 failures are new
  • 43 tests were fixed
  • 122 tests were quarantined / skipped
  • 86 minutes taken in total.
New test failures 2
Status Test Duration
Collapse Failed DGMInferencingTests testDGM19 History
< 1 sec
java.lang.AssertionError: Expected type not found.
Expected: java.lang.Integer
Found: java.lang.Object
Declaring type: Search
ASTNode: org.codehaus.groovy.ast.expr.VariableExpression@f532e[variable: value]
Confidence: INFERRED

java.lang.AssertionError: 
(9 more lines...)
Collapse Failed DGMInferencingTests testDGM7 History
< 1 sec
java.lang.AssertionError: Expected type not found.
Expected: java.lang.String
Found: java.lang.Object
Declaring type: Search
ASTNode: org.codehaus.groovy.ast.expr.VariableExpression@f0080[variable: key]
Confidence: INFERRED

java.lang.AssertionError: 
(9 more lines...)
Existing test failures 1
Status Test Failing since Duration
junit.framework.ComparisonFailure: 
----------- Expected ------------

------------ but was ------------
Problem : The import util.MyException is never used [ resource : </Project/src/p/Test.java> range : <18,34> category : <120> severity : <1>]

--------- Difference is ----------
 expected:<[]> but was:<[Problem : The import util.MyException is never used [ resource : </Project/src/p/Test.java> range : <18,34> category : <120> severity : <1>]
(12 more lines...)
Fixed tests 43
Status Test Failing since Duration
Successful RenameFieldTests test10 History
Failing since build #461 (Code changes detected) 5 secs
Successful RenameFieldTests test11 History
Failing since build #461 (Code changes detected) 1 sec
Successful RenameFieldTests test13 History
Failing since build #461 (Code changes detected) 1 sec
Successful RenameFieldTests test14 History
Failing since build #461 (Code changes detected) 1 sec
Successful RenameFieldTests test2 History
Failing since build #461 (Code changes detected) 1 sec
Successful RenameFieldTests test3 History
Failing since build #461 (Code changes detected) 1 sec
Successful RenameFieldTests test4 History
Failing since build #461 (Code changes detected) 1 sec
Successful RenameFieldTests test5 History
Failing since build #461 (Code changes detected) 1 sec
Successful RenameFieldTests test6 History
Failing since build #461 (Code changes detected) 1 sec
Successful RenameFieldTests test7 History
Failing since build #461 (Code changes detected) 1 sec
Successful RenameFieldTests test8 History
Failing since build #461 (Code changes detected) 1 sec
Successful RenameFieldTests test9 History
Failing since build #461 (Code changes detected) 1 sec
Successful RenameFieldTests testInitializer1 History
Failing since build #461 (Code changes detected) 1 sec
Successful RenameFieldTests testInitializer2 History
Failing since build #461 (Code changes detected) 1 sec
Successful RenameFieldTests testInitializer3 History
Failing since build #461 (Code changes detected) 1 sec
Successful RenameFieldTests testScript1 History
Failing since build #461 (Code changes detected) 1 sec
Successful RenameFieldTests testScript2 History
Failing since build #461 (Code changes detected) 1 sec
Successful RenameMethodTests test1 History
Failing since build #461 (Code changes detected) 1 sec
Successful RenameMethodTests test2 History
Failing since build #461 (Code changes detected) 1 sec
Successful RenameMethodTests test3 History
Failing since build #461 (Code changes detected) 1 sec
Successful RenameMethodTests test4 History
Failing since build #461 (Code changes detected) 1 sec
Successful RenameMethodTests test5 History
Failing since build #461 (Code changes detected) 1 sec
Successful RenameMethodTests test6 History
Failing since build #461 (Code changes detected) 1 sec
Successful RenameMethodTests test7 History
Failing since build #461 (Code changes detected) 1 sec
Successful RenameMethodTests test8 History
Failing since build #461 (Code changes detected) 1 sec
Successful RenameMethodTests test9 History
Failing since build #461 (Code changes detected) 1 sec
Successful RenameMethodTests testAnonOverrides History
Failing since build #461 (Code changes detected) 10 secs
Successful RenameMethodTests testEnumOverrides History
Failing since build #461 (Code changes detected) 1 sec
Successful RenameMethodTests testEnumOverrides2 History
Failing since build #461 (Code changes detected) 1 sec
Successful RenameMethodTests testInitializer1 History
Failing since build #461 (Code changes detected) 1 sec
Successful RenameMethodTests testInitializer2 History
Failing since build #461 (Code changes detected) 1 sec
Successful RenameMethodTests testInitializer3 History
Failing since build #461 (Code changes detected) 1 sec
Successful RenameMethodTests testOverload1 History
Failing since build #461 (Code changes detected) 2 secs
Successful RenameMethodTests testOverload2 History
Failing since build #461 (Code changes detected) 2 secs
Successful RenameMethodTests testOverload3 History
Failing since build #461 (Code changes detected) 1 sec
Successful RenameMethodTests testStaticImport History
Failing since build #461 (Code changes detected) 1 sec
Successful BasicGroovyBuildTests testBuildGroovyHelloWorld History
Failing since build #461 (Code changes detected) < 1 sec
Successful ConstructorReferenceSearchTests testConstructorReferences1 History
Failing since build #461 (Code changes detected) < 1 sec
Successful ConstructorReferenceSearchTests testConstructorReferences11 History
Failing since build #461 (Code changes detected) < 1 sec
Successful ConstructorReferenceSearchTests testConstructorReferences8 History
Failing since build #461 (Code changes detected) < 1 sec
Successful ConstructorReferenceSearchTests testNewifyConstructorReferences1 History
Failing since build #461 (Code changes detected) < 1 sec
Successful DGMInferencingTests testDGM22 History
Failing since build #461 (Code changes detected) < 1 sec
Successful DGMInferencingTests testDGMClosure16 History
Failing since build #461 (Code changes detected) < 1 sec

Error summary

The build generated some errors. See the full build log for more details.


(SWT:22976): Gtk-CRITICAL **: 19:14:51.612: gtk_box_gadget_distribute: assertion 'size >= 0' failed in GtkScrollbar
TypeInferencingVisitorWithRequestor.findMethodNode: no match found for Main.main([Qjava.lang.String;)
TypeInferencingVisitorWithRequestor.findMethodNode: no match found for Main.main([Qjava.lang.String;)
TypeInferencingVisitorWithRequestor.findMethodNode: no match found for Outer$Bar.meth(QFoo;)
TypeInferencingVisitorWithRequestor.findMethodNode: no match found for Outer$Bar.meth(QFoo;)
CodeSelectRequestor: Could not proceed due to null declaring type for org.codehaus.groovy.ast.expr.BinaryExpression@ecbea[org.codehaus.groovy.ast.expr.VariableExpression@ecbe3[variable: it]("in" at 1:20:  "in" )org.codehaus.groovy.ast.expr.ListExpression@ee270[]]
CodeSelectRequestor: Could not proceed due to null declaring type for org.codehaus.groovy.ast.expr.RangeExpression@ebcdd
CodeSelectRequestor: Could not proceed due to null declaring type for org.codehaus.groovy.ast.expr.RangeExpression@ebcde
TypeInferencingVisitorWithRequestor.findMethodNode: no match found for Type.x(QList<Qjava.util.Date;>;)
TypeInferencingVisitorWithRequestor.findMethodNode: no match found for Type.x(QList<Qjava.lang.Number;>;)
TypeInferencingVisitorWithRequestor.findMethodNode: no match found for Type.x(QList<Qjava.lang.Number;>;)
TypeInferencingVisitorWithRequestor.findMethodNode: no match found for Type.x(QList<Qjava.util.Date;>;)
TypeInferencingVisitorWithRequestor.findMethodNode: no match found for Type.x(QList<Qjava.lang.Number;>;)
TypeInferencingVisitorWithRequestor.findMethodNode: no match found for Type.x(QList<Qjava.lang.Number;>;)
CodeSelectRequestor: Could not proceed due to null declaring type for org.codehaus.groovy.ast.expr.ConstantExpression@e8fc6[fff]
CodeSelectRequestor: Could not proceed due to null declaring type for org.codehaus.groovy.ast.expr.ConstantExpression@e8fca[fff]
CodeSelectRequestor: Could not proceed due to null declaring type for org.codehaus.groovy.ast.expr.ConstantExpression@e8fca[fff]
Waiting for: Java indexing... 9 files to index (/opt/jdk8u212-b03/jre/lib/ext/jaccess.jar)
Waiting for: Java indexing... 22 files to index (/Project)
Waiting for: Java indexing... 22 files to index (/Project)
Waiting for: Java indexing... 22 files to index (/Project)
Waiting for: Java indexing... 22 files to index (/Project)
Waiting for: Java indexing... 22 files to index (/Project)
Waiting for: Java indexing... 22 files to index (/Project)
TypeInferencingVisitorWithRequestor.findMethodNode: no match found for Outer$Inner2.meth(QInner1;)
TypeInferencingVisitorWithRequestor.findMethodNode: no match found for Outer$Inner2.meth(QInner1;)
TypeInferencingVisitorWithRequestor.findMethodNode: no match found for Groovy20.bug(QLetter;)
Waiting for: Java indexing... 21 files to index (/Project)
Waiting for: Java indexing... 21 files to index (/Project)
Waiting for: Java indexing... 21 files to index (/Project)
Waiting for: Java indexing... 19 files to index (/opt/jdk8u212-b03/jre/lib/rt.jar)