Build: #465 failed

Job: Default Job failed

Stages & jobs

  1. Default Stage

Job result summary

Completed
Duration
91 minutes
Agent
bamboo-15.af.pivotal.io
Revision
f8e07c0a2d6831ca9042c7da1d705a3a664dc988 f8e07c0a2d6831ca9042c7da1d705a3a664dc988
Total tests
6057
Failing since
#448 (Code changes detected – )

Tests

  • 6,057 tests in total
  • 5 tests failed
  • 4 failures are new
  • 49 tests were fixed
  • 122 tests were quarantined / skipped
  • 87 minutes taken in total.
New test failures 4
Status Test Duration
Collapse Failed ConstructorReferenceSearchTests testConstructorReferences1 History
< 1 sec
java.lang.AssertionError: Incorrect number of matches; expected:<3> but was:<0>
	at org.eclipse.jdt.core.groovy.tests.search.ConstructorReferenceSearchTests.testConstructorReferences1(ConstructorReferenceSearchTests.java:59)
Collapse Failed ConstructorReferenceSearchTests testConstructorReferences10 History
< 1 sec
java.lang.AssertionError: expected:<1> but was:<0>
	at org.eclipse.jdt.core.groovy.tests.search.ConstructorReferenceSearchTests.testConstructorReferences10(ConstructorReferenceSearchTests.java:258)
Collapse Failed ConstructorReferenceSearchTests testConstructorReferences12 History
< 1 sec
java.lang.AssertionError: expected:<2> but was:<0>
	at org.eclipse.jdt.core.groovy.tests.search.ConstructorReferenceSearchTests.testConstructorReferences12(ConstructorReferenceSearchTests.java:313)
Collapse Failed ConstructorReferenceSearchTests testConstructorReferences2 History
< 1 sec
java.lang.AssertionError: Incorrect number of matches; expected:<1> but was:<0>
	at org.eclipse.jdt.core.groovy.tests.search.ConstructorReferenceSearchTests.testConstructorReferences2(ConstructorReferenceSearchTests.java:96)
Existing test failures 1
Status Test Failing since Duration
junit.framework.ComparisonFailure: 
----------- Expected ------------

------------ but was ------------
Problem : The import util.MyException is never used [ resource : </Project/src/p/Test.java> range : <18,34> category : <120> severity : <1>]

--------- Difference is ----------
 expected:<[]> but was:<[Problem : The import util.MyException is never used [ resource : </Project/src/p/Test.java> range : <18,34> category : <120> severity : <1>]
(12 more lines...)
Fixed tests 49
Status Test Failing since Duration
Successful RenameFieldTests test10 History
Failing since build #464 (Code changes detected) 5 secs
Successful RenameFieldTests test11 History
Failing since build #464 (Code changes detected) 1 sec
Successful RenameFieldTests test13 History
Failing since build #464 (Code changes detected) 1 sec
Successful RenameFieldTests test14 History
Failing since build #464 (Code changes detected) 1 sec
Successful RenameFieldTests test2 History
Failing since build #464 (Code changes detected) 1 sec
Successful RenameFieldTests test3 History
Failing since build #464 (Code changes detected) 1 sec
Successful RenameFieldTests test4 History
Failing since build #464 (Code changes detected) 1 sec
Successful RenameFieldTests test5 History
Failing since build #464 (Code changes detected) 1 sec
Successful RenameFieldTests test6 History
Failing since build #464 (Code changes detected) 1 sec
Successful RenameFieldTests test7 History
Failing since build #464 (Code changes detected) 1 sec
Successful RenameFieldTests test8 History
Failing since build #464 (Code changes detected) 1 sec
Successful RenameFieldTests test9 History
Failing since build #464 (Code changes detected) 1 sec
Successful RenameFieldTests testInitializer1 History
Failing since build #464 (Code changes detected) 1 sec
Successful RenameFieldTests testInitializer2 History
Failing since build #464 (Code changes detected) 1 sec
Successful RenameFieldTests testInitializer3 History
Failing since build #464 (Code changes detected) 1 sec
Successful RenameFieldTests testScript1 History
Failing since build #464 (Code changes detected) 1 sec
Successful RenameFieldTests testScript2 History
Failing since build #464 (Code changes detected) 1 sec
Successful RenameTypeTests test1 History
Failing since build #464 (Code changes detected) 1 sec
Successful RenameTypeTests test10 History
Failing since build #464 (Code changes detected) 1 sec
Successful RenameTypeTests test11 History
Failing since build #464 (Code changes detected) 1 sec
Successful RenameTypeTests test12 History
Failing since build #464 (Code changes detected) 1 sec
Successful RenameTypeTests test13 History
Failing since build #464 (Code changes detected) 1 sec
Successful RenameTypeTests test2 History
Failing since build #464 (Code changes detected) 1 sec
Successful RenameTypeTests test3 History
Failing since build #464 (Code changes detected) 1 sec
Successful RenameTypeTests test4 History
Failing since build #464 (Code changes detected) 1 sec
Successful RenameTypeTests test5 History
Failing since build #464 (Code changes detected) 1 sec
Successful RenameTypeTests test6 History
Failing since build #464 (Code changes detected) 1 sec
Successful RenameTypeTests test7 History
Failing since build #464 (Code changes detected) 1 sec
Successful RenameTypeTests test8 History
Failing since build #464 (Code changes detected) 1 sec
Successful RenameTypeTests test9 History
Failing since build #464 (Code changes detected) 1 sec
Successful RenameTypeTests testAlias1 History
Failing since build #464 (Code changes detected) 1 sec
Successful RenameTypeTests testAnnotation1 History
Failing since build #464 (Code changes detected) 1 sec
Successful RenameTypeTests testAnnotation2 History
Failing since build #464 (Code changes detected) 1 sec
Successful RenameTypeTests testAnnotation3 History
Failing since build #464 (Code changes detected) 1 sec
Successful RenameTypeTests testEnum1 History
Failing since build #464 (Code changes detected) 1 sec
Successful RenameTypeTests testEnum2 History
Failing since build #464 (Code changes detected) 1 sec
Successful RenameTypeTests testGenerics1 History
Failing since build #464 (Code changes detected) 1 sec
Successful RenameTypeTests testGenerics2 History
Failing since build #464 (Code changes detected) 1 sec
Successful RenameTypeTests testGenerics3 History
Failing since build #464 (Code changes detected) 1 sec
Successful RenameTypeTests testGenerics4 History
Failing since build #464 (Code changes detected) 1 sec
Successful RenameTypeTests testGenerics5 History
Failing since build #464 (Code changes detected) 1 sec
Successful RenameTypeTests testInner1 History
Failing since build #464 (Code changes detected) 1 sec
Successful RenameTypeTests testInner2 History
Failing since build #464 (Code changes detected) 1 sec
Successful RenameTypeTests testInner3 History
Failing since build #464 (Code changes detected) 1 sec
Successful RenameTypeTests testJavadoc1 History
Failing since build #464 (Code changes detected) 1 sec
Successful BinarySearchTests testClassDecl1 History
Failing since build #464 (Code changes detected) 1 sec
Successful BinarySearchTests testMethodDecl History
Failing since build #464 (Code changes detected) < 1 sec
Successful ConstructorReferenceSearchTests testConstructorReferences11a History
Failing since build #464 (Code changes detected) < 1 sec
Successful TypeReferenceSearchTests testFindClassDeclarationWithPattern History
Failing since build #464 (Code changes detected) < 1 sec

Error summary

The build generated some errors. See the full build log for more details.


(SWT:8580): Gtk-WARNING **: 20:56:52.183: gtk_widget_size_allocate(): attempt to allocate widget with width -3 and height -3

(SWT:8580): Gtk-CRITICAL **: 20:56:54.906: gtk_box_gadget_distribute: assertion 'size >= 0' failed in GtkScrollbar
TypeInferencingVisitorWithRequestor.findMethodNode: no match found for Main.main([Qjava.lang.String;)
TypeInferencingVisitorWithRequestor.findMethodNode: no match found for Main.main([Qjava.lang.String;)
TypeInferencingVisitorWithRequestor.findMethodNode: no match found for Outer$Bar.meth(QFoo;)
TypeInferencingVisitorWithRequestor.findMethodNode: no match found for Outer$Bar.meth(QFoo;)
CodeSelectRequestor: Could not proceed due to null declaring type for org.codehaus.groovy.ast.expr.BinaryExpression@ecbea[org.codehaus.groovy.ast.expr.VariableExpression@ecbe3[variable: it]("in" at 1:20:  "in" )org.codehaus.groovy.ast.expr.ListExpression@ee270[]]
CodeSelectRequestor: Could not proceed due to null declaring type for org.codehaus.groovy.ast.expr.RangeExpression@ebcdd
CodeSelectRequestor: Could not proceed due to null declaring type for org.codehaus.groovy.ast.expr.RangeExpression@ebcde
TypeInferencingVisitorWithRequestor.findMethodNode: no match found for Type.x(QList<Qjava.util.Date;>;)
TypeInferencingVisitorWithRequestor.findMethodNode: no match found for Type.x(QList<Qjava.lang.Number;>;)
TypeInferencingVisitorWithRequestor.findMethodNode: no match found for Type.x(QList<Qjava.lang.Number;>;)
TypeInferencingVisitorWithRequestor.findMethodNode: no match found for Type.x(QList<Qjava.util.Date;>;)
TypeInferencingVisitorWithRequestor.findMethodNode: no match found for Type.x(QList<Qjava.lang.Number;>;)
TypeInferencingVisitorWithRequestor.findMethodNode: no match found for Type.x(QList<Qjava.lang.Number;>;)
CodeSelectRequestor: Could not proceed due to null declaring type for org.codehaus.groovy.ast.expr.ConstantExpression@e8fc6[fff]
CodeSelectRequestor: Could not proceed due to null declaring type for org.codehaus.groovy.ast.expr.ConstantExpression@e8fca[fff]
CodeSelectRequestor: Could not proceed due to null declaring type for org.codehaus.groovy.ast.expr.ConstantExpression@e8fca[fff]
Waiting for: Java indexing... 3 files to index (/Project)
Waiting for: Java indexing... 4 files to index (/opt/bamboo-home/xml-data/build-dir/GRECLIPSE-GE49-JOB1/ide-test/org.codehaus.groovy.alltests/target/work/plugins/org.eclipse.jdt.groovy.core.tests.builder_3.6.0.v201910122055-e1809/lib/binGroovySearch.jar)
Waiting for: Java indexing... 22 files to index (/Project)
Waiting for: Java indexing... 22 files to index (/Project)
Waiting for: Java indexing... 22 files to index (/Project)
Waiting for: Java indexing... 22 files to index (/Project)
TypeInferencingVisitorWithRequestor.findMethodNode: no match found for Outer$Inner2.meth(QInner1;)
TypeInferencingVisitorWithRequestor.findMethodNode: no match found for Outer$Inner2.meth(QInner1;)
TypeInferencingVisitorWithRequestor.findMethodNode: no match found for Groovy20.bug(QLetter;)
Waiting for: Java indexing... 3 files to index (/Project)
Waiting for: Java indexing... 21 files to index (/Project)
Waiting for: Java indexing... 21 files to index (/Project)
Waiting for: Flushing content description cache.
Waiting for: Java indexing... 3 files to index (/Project)