Build: #473 failed

Job: Default Job failed

Stages & jobs

  1. Default Stage

Job result summary

Completed
Duration
91 minutes
Agent
bamboo-17.af.pivotal.io
Revision
f49cec65ce464fa0fbf731036b97b0855cb09a5b f49cec65ce464fa0fbf731036b97b0855cb09a5b
Total tests
6084
Failing since
#448 (Code changes detected – )

Tests

  • 6,084 tests in total
  • 33 tests failed
  • 4 failures are new
  • 21 tests were fixed
  • 122 tests were quarantined / skipped
  • 87 minutes taken in total.
New test failures 4
Status Test Duration
Collapse Failed BasicGroovyBuildTests testAnnotationCollectorIncremental History
< 1 sec
org.junit.ComparisonFailure: unexpected recompiled units. lenExpected=5 lenActual=3 expected:<...ISBN$CollectorHelper[,Length,NotNull]}> but was:<...ISBN$CollectorHelper[]}>
	at org.eclipse.jdt.core.groovy.tests.builder.BasicGroovyBuildTests.testAnnotationCollectorIncremental(BasicGroovyBuildTests.java:1690)
Collapse Failed BinarySearchTests testFieldRefInInitializer History
1 sec
java.lang.AssertionError: Expecting 1 matches, but found 0

java.lang.AssertionError: 
Expecting 1 matches, but found 0

	at org.eclipse.jdt.core.groovy.tests.search.BinarySearchTests.assertMatches(BinarySearchTests.java:139)
	at org.eclipse.jdt.core.groovy.tests.search.BinarySearchTests.testFieldRefInInitializer(BinarySearchTests.java:208)
Collapse Failed ConstructorReferenceSearchTests testConstructorReferences2 History
< 1 sec
java.lang.AssertionError: Incorrect number of matches; expected:<1> but was:<0>
	at org.eclipse.jdt.core.groovy.tests.search.ConstructorReferenceSearchTests.testConstructorReferences2(ConstructorReferenceSearchTests.java:96)
Collapse Failed ConstructorReferenceSearchTests testNewifyConstructorReferences4 History
< 1 sec
java.lang.AssertionError: expected:<2> but was:<0>
	at org.eclipse.jdt.core.groovy.tests.search.ConstructorReferenceSearchTests.testNewifyConstructorReferences4(ConstructorReferenceSearchTests.java:450)
Existing test failures 29
Status Test Failing since Duration
org.junit.ComparisonFailure: invalid renaming expected:<...
class B{
   void m([B] a){};
}> but was:<...
class B{
   void m([A] a){};
}>
org.junit.ComparisonFailure: 
(11 more lines...)
org.junit.ComparisonFailure: invalid renaming expected:<...her {
    def x = { [B] a ->
              ...> but was:<...her {
    def x = { [A] a ->
              ...>
org.junit.ComparisonFailure: 
invalid renaming expected:<...her {
    def x = { [B] a ->
(7 more lines...)
org.junit.ComparisonFailure: invalid renaming expected:<...tatic x() {
        [B]
    }
}> but was:<...tatic x() {
        [A]
    }
}>
org.junit.ComparisonFailure: 
(11 more lines...)
org.junit.ComparisonFailure: invalid renaming expected:<...  def x() {
        [B]
    }
}> but was:<...  def x() {
        [A]
    }
}>
org.junit.ComparisonFailure: 
(11 more lines...)
org.junit.ComparisonFailure: invalid renaming expected:<...lic class B {
    B([B a){}
    B a(B a){
        a= new B(new B](a));
        return...> but was:<...lic class B {
    B([A a){}
    A a(A a){
        a= new A(new A](a));
(15 more lines...)
org.junit.ComparisonFailure: invalid renaming expected:<...
class B{
   void m([B a){};
}

class Sub extends B {
    void m(B] a){}
}> but was:<...
(27 more lines...)
org.junit.ComparisonFailure: invalid renaming expected:<...erface B{
   void m([B a);
}

class Sub implements B {
    void m(B] a){}
}> but was:<...erface B{
   void m([A a);
(23 more lines...)
org.junit.ComparisonFailure: invalid renaming expected:<...kage p;
class B{
   [B] m(a) {}
}> but was:<...kage p;
class B{
   [A] m(a) {}
}>
org.junit.ComparisonFailure: 
(11 more lines...)
org.junit.ComparisonFailure: invalid renaming expected:<...  def x() {
        [B x = new B]()
    }
}> but was:<...  def x() {
        [A x = new A]()
    }
}>
org.junit.ComparisonFailure: 
(11 more lines...)
org.junit.ComparisonFailure: invalid renaming expected:<...

class Other {
    [B x = new B]()
}> but was:<...

class Other {
    [A x = new A]()
(15 more lines...)
org.junit.ComparisonFailure: invalid renaming expected:<...

class Other {
    [B x() {
        def x = {
                B a = new B]()
        }
    }
(31 more lines...)
org.junit.ComparisonFailure: invalid renaming expected:<...

class Other {
    [B x() {
        def x = { B] a ->
              ...> but was:<...

class Other {
(19 more lines...)
org.junit.ComparisonFailure: invalid renaming expected:<...f x = {
            [B a = new B]()
    }
}> but was:<...f x = {
            [A a = new A]()
    }
}>
org.junit.ComparisonFailure: 
(11 more lines...)
org.junit.ComparisonFailure: invalid renaming in p2.A expected:<...ckage p2;

import p.[B] as Other;

class C ...> but was:<...ckage p2;

import p.[A] as Other;

(12 more lines...)
org.junit.ComparisonFailure: invalid renaming expected:<...
@interface B { }

@[B
class Client {
    @Deprecated @B]() void bad() { }
}> but was:<...
@interface B { }
(23 more lines...)
org.junit.ComparisonFailure: invalid renaming expected:<...interface Main {
   [B child() default @B("Void");
}

@Main(child=@/*test*/B(""))
@B("")
class Client {
    @Deprecated
(47 more lines...)
org.junit.ComparisonFailure: invalid renaming expected:<... default "NULL";
}
@[B("")
class Test {
    
    @B("A and p.Test.A and p.A and q.Test.A")
    void test () {
        ArrayList<String> list= new ArrayList<String>() {
(39 more lines...)
org.junit.ComparisonFailure: invalid renaming in p2.A expected:<...ckage p2;

import p.[B;

class C {
    p.B a= p.B.ONE;
    p.B b= p.B].ONE;
    C a2= new ...> but was:<...ckage p2;
(24 more lines...)
org.junit.ComparisonFailure: invalid renaming expected:<...ONE ,
    BIG ;
    [B longerNameThan(B] a) { a }
}
> but was:<...ONE ,
    BIG ;
    [A longerNameThan(A] a) { a }
}
(15 more lines...)
org.junit.ComparisonFailure: invalid renaming expected:<...X x) {}

    void m([B a) {
        new B<T>();
        new B<T>(null, "y");
    };
}

(59 more lines...)
org.junit.ComparisonFailure: invalid renaming expected:<...A> {
    A a;
    p.[B pa= new p.B]();
}
> but was:<...A> {
    A a;
    p.[A pa= new p.A]();
}
(15 more lines...)
org.junit.ComparisonFailure: invalid renaming expected:<...  ArrayList<? super [B> fSink;
}

class U extends ArrayList<B> {
    public boolean add(B arg0) {
        return false;
    }
}
(35 more lines...)
org.junit.ComparisonFailure: invalid renaming expected:<...    Class<? extends [B> class1= this.getClass();
    Class<? extends B> class2= B.class;
    Class<B> class3= (Class<B>) this.getClass();
    X<B> getX() {
        X<B> x= new X<B>();
        x.t= (new ArrayList<B>() as B[]);
        return x;
    }
(51 more lines...)
org.junit.ComparisonFailure: expected:<...p

class C {
  List<[B> list1
  List<? super B> list2
  List<? extends B> list3
  List<Collection<B>> list4

(36 more lines...)
org.junit.ComparisonFailure: invalid renaming expected:<...e p

import p.Outer.[B
import p.Outer.AZ

class Outer {
  class B {
  }
(85 more lines...)
org.junit.ComparisonFailure: invalid renaming expected:<...n.*
import static p.[Wrapper.Inner.*
import p.OuterAgain.InnerAgain
import p.Wrapper.Inner
import p.OuterAgain.*
import p.Wrapper.*

class Wrapper {
(85 more lines...)
org.junit.ComparisonFailure: expected:<...n.*
import static p.[Wrapper.Inner.*
import p.OuterAgain.InnerAgain
import p.Wrapper.Inner
import p.OuterAgain.*
import p.Wrapper.*

val = OuterAgain.InnerAgain.thing
(36 more lines...)
org.junit.ComparisonFailure: invalid renaming expected:<package p;
/**
 * [B
 */
class B{ }

class Other {
    def x = {
(37 more lines...)
junit.framework.ComparisonFailure: 
----------- Expected ------------

------------ but was ------------
Problem : The import util.MyException is never used [ resource : </Project/src/p/Test.java> range : <18,34> category : <120> severity : <1>]

--------- Difference is ----------
 expected:<[]> but was:<[Problem : The import util.MyException is never used [ resource : </Project/src/p/Test.java> range : <18,34> category : <120> severity : <1>]
(12 more lines...)
Fixed tests 21
Status Test Failing since Duration
Successful RenameFieldTests test10 History
Failing since build #472 (Code changes detected) 5 secs
Successful RenameFieldTests test11 History
Failing since build #472 (Code changes detected) 1 sec
Successful RenameFieldTests test13 History
Failing since build #472 (Code changes detected) 1 sec
Successful RenameFieldTests test14 History
Failing since build #472 (Code changes detected) 1 sec
Successful RenameFieldTests test2 History
Failing since build #472 (Code changes detected) 1 sec
Successful RenameFieldTests test3 History
Failing since build #472 (Code changes detected) 1 sec
Successful RenameFieldTests test4 History
Failing since build #472 (Code changes detected) 1 sec
Successful RenameFieldTests test5 History
Failing since build #472 (Code changes detected) 1 sec
Successful RenameFieldTests test6 History
Failing since build #472 (Code changes detected) 1 sec
Successful RenameFieldTests test7 History
Failing since build #472 (Code changes detected) 1 sec
Successful RenameFieldTests test8 History
Failing since build #472 (Code changes detected) 1 sec
Successful RenameFieldTests test9 History
Failing since build #472 (Code changes detected) 1 sec
Successful RenameFieldTests testInitializer1 History
Failing since build #472 (Code changes detected) 1 sec
Successful RenameFieldTests testInitializer2 History
Failing since build #472 (Code changes detected) 1 sec
Successful RenameFieldTests testInitializer3 History
Failing since build #472 (Code changes detected) 1 sec
Successful RenameFieldTests testScript1 History
Failing since build #472 (Code changes detected) 1 sec
Successful RenameFieldTests testScript2 History
Failing since build #472 (Code changes detected) 1 sec
Successful BasicGroovyBuildTests testBuildGroovy2 History
Failing since build #472 (Code changes detected) < 1 sec
Successful BasicGroovyBuildTests testIncrementalCompilationTheBasics History
Failing since build #472 (Code changes detected) < 1 sec
Successful BasicGroovyBuildTests testSlow_GRE870 History
Failing since build #472 (Code changes detected) < 1 sec
Successful MethodReferenceSearchTests testExplicitPropertySetterSearch2 History
Failing since build #472 (Code changes detected) 1 sec

Error summary

The build generated some errors. See the full build log for more details.


(SWT:20907): Gtk-CRITICAL **: 16:00:08.583: gtk_box_gadget_distribute: assertion 'size >= 0' failed in GtkScrollbar
TypeInferencingVisitorWithRequestor.findMethodNode: no match found for Main.main([Qjava.lang.String;)
TypeInferencingVisitorWithRequestor.findMethodNode: no match found for Main.main([Qjava.lang.String;)
TypeInferencingVisitorWithRequestor.findMethodNode: no match found for Outer$Bar.meth(QFoo;)
TypeInferencingVisitorWithRequestor.findMethodNode: no match found for Outer$Bar.meth(QFoo;)
CodeSelectRequestor: Could not proceed due to null declaring type for org.codehaus.groovy.ast.expr.BinaryExpression@ecbea[org.codehaus.groovy.ast.expr.VariableExpression@ecbe3[variable: it]("in" at 1:20:  "in" )org.codehaus.groovy.ast.expr.ListExpression@ee270[]]
CodeSelectRequestor: Could not proceed due to null declaring type for org.codehaus.groovy.ast.expr.RangeExpression@ebcdd
CodeSelectRequestor: Could not proceed due to null declaring type for org.codehaus.groovy.ast.expr.RangeExpression@ebcde
TypeInferencingVisitorWithRequestor.findMethodNode: no match found for Type.x(QList<Qjava.util.Date;>;)
TypeInferencingVisitorWithRequestor.findMethodNode: no match found for Type.x(QList<Qjava.lang.Number;>;)
TypeInferencingVisitorWithRequestor.findMethodNode: no match found for Type.x(QList<Qjava.util.Date;>;)
TypeInferencingVisitorWithRequestor.findMethodNode: no match found for Type.x(QList<Qjava.lang.Number;>;)
TypeInferencingVisitorWithRequestor.findMethodNode: no match found for Type.x(QList<Qjava.lang.Number;>;)
CodeSelectRequestor: Could not proceed due to null declaring type for org.codehaus.groovy.ast.expr.ConstantExpression@e8fc6[fff]
CodeSelectRequestor: Could not proceed due to null declaring type for org.codehaus.groovy.ast.expr.ConstantExpression@e8fca[fff]
CodeSelectRequestor: Could not proceed due to null declaring type for org.codehaus.groovy.ast.expr.ConstantExpression@e8fca[fff]
Waiting for: Java indexing... 18 files to index (/opt/jdk8u212-b03/jre/lib/rt.jar)
Waiting for: Building workspace
Waiting for: Java indexing... 22 files to index (/Project)
Waiting for: Java indexing... 22 files to index (/Project)
Waiting for: Java indexing... 22 files to index (/Project)
Waiting for: Java indexing... 22 files to index (/Project)
Waiting for: Java indexing... 22 files to index (/Project)
Waiting for: Java indexing... 22 files to index (/Project)
TypeInferencingVisitorWithRequestor.findMethodNode: no match found for Outer$Inner2.meth(QInner1;)
TypeInferencingVisitorWithRequestor.findMethodNode: no match found for Outer$Inner2.meth(QInner1;)
TypeInferencingVisitorWithRequestor.findMethodNode: no match found for Groovy20.bug(QLetter;)
Waiting for: Java indexing... 20 files to index (/Project)
Waiting for: Java indexing... 8 files to index (/opt/jdk8u212-b03/jre/lib/ext/jaccess.jar)
Waiting for: Java indexing... 21 files to index (/Project)
Waiting for: Flushing content description cache.
Waiting for: Java indexing... 21 files to index (/Project)