Build: #531 failed

Job: Default Job failed

Stages & jobs

  1. Default Stage

Build log

The build generated 614,389 lines of output.The output is too long and has been truncated to the last 1,000 lines. Download or view full build log

09-Dec-2019 00:05:41 testStaticMethodOverloads3(org.eclipse.jdt.core.groovy.tests.search.GenericInferencingTests)  Time elapsed: 0.187 s
09-Dec-2019 00:05:41 testStaticMethodOverloads4(org.eclipse.jdt.core.groovy.tests.search.GenericInferencingTests)  Time elapsed: 0.207 s
09-Dec-2019 00:05:41 testStaticMethodOverloads5(org.eclipse.jdt.core.groovy.tests.search.GenericInferencingTests)  Time elapsed: 0.208 s
09-Dec-2019 00:05:41 testStaticMethodOverloads6(org.eclipse.jdt.core.groovy.tests.search.GenericInferencingTests)  Time elapsed: 0.191 s
09-Dec-2019 00:05:41 testStaticMethodOverloads7(org.eclipse.jdt.core.groovy.tests.search.GenericInferencingTests)  Time elapsed: 0.171 s
09-Dec-2019 00:05:41 testStaticMethodOverloads8(org.eclipse.jdt.core.groovy.tests.search.GenericInferencingTests)  Time elapsed: 0.183 s
09-Dec-2019 00:05:41 testStaticMethodOverloads9(org.eclipse.jdt.core.groovy.tests.search.GenericInferencingTests)  Time elapsed: 0.214 s
09-Dec-2019 00:05:41 testNestedGenerics1(org.eclipse.jdt.core.groovy.tests.search.GenericInferencingTests)  Time elapsed: 0.217 s
09-Dec-2019 00:05:41 testNestedGenerics2(org.eclipse.jdt.core.groovy.tests.search.GenericInferencingTests)  Time elapsed: 0.222 s
09-Dec-2019 00:05:41 testNestedGenerics3(org.eclipse.jdt.core.groovy.tests.search.GenericInferencingTests)  Time elapsed: 0.201 s
09-Dec-2019 00:05:41 testNestedGenerics4(org.eclipse.jdt.core.groovy.tests.search.GenericInferencingTests)  Time elapsed: 0.194 s
09-Dec-2019 00:05:41 testNestedGenerics5(org.eclipse.jdt.core.groovy.tests.search.GenericInferencingTests)  Time elapsed: 0.178 s
09-Dec-2019 00:05:41 testNestedGenerics6(org.eclipse.jdt.core.groovy.tests.search.GenericInferencingTests)  Time elapsed: 0.197 s
09-Dec-2019 00:05:41 testNestedGenerics7(org.eclipse.jdt.core.groovy.tests.search.GenericInferencingTests)  Time elapsed: 0.211 s
09-Dec-2019 00:05:41 testNestedGenerics8(org.eclipse.jdt.core.groovy.tests.search.GenericInferencingTests)  Time elapsed: 0.182 s
09-Dec-2019 00:05:41 testStaticMethod10(org.eclipse.jdt.core.groovy.tests.search.GenericInferencingTests)  Time elapsed: 0.225 s
09-Dec-2019 00:05:41 testStaticMethod11(org.eclipse.jdt.core.groovy.tests.search.GenericInferencingTests)  Time elapsed: 0.244 s
09-Dec-2019 00:05:41 testMethod1(org.eclipse.jdt.core.groovy.tests.search.GenericInferencingTests)  Time elapsed: 0.206 s
09-Dec-2019 00:05:41 testMethod2(org.eclipse.jdt.core.groovy.tests.search.GenericInferencingTests)  Time elapsed: 0.277 s
09-Dec-2019 00:05:41 testMethod3(org.eclipse.jdt.core.groovy.tests.search.GenericInferencingTests)  Time elapsed: 0.208 s
09-Dec-2019 00:05:41 testMethod4(org.eclipse.jdt.core.groovy.tests.search.GenericInferencingTests)  Time elapsed: 0.199 s
09-Dec-2019 00:05:41 testGetClass1(org.eclipse.jdt.core.groovy.tests.search.GenericInferencingTests)  Time elapsed: 0.217 s
09-Dec-2019 00:05:41 testGetClass2(org.eclipse.jdt.core.groovy.tests.search.GenericInferencingTests)  Time elapsed: 0.207 s
09-Dec-2019 00:05:41 testGetClass3(org.eclipse.jdt.core.groovy.tests.search.GenericInferencingTests)  Time elapsed: 0.18 s
09-Dec-2019 00:05:41 testCircularReference(org.eclipse.jdt.core.groovy.tests.search.GenericInferencingTests)  Time elapsed: 0.308 s
09-Dec-2019 00:05:41 testForLoop1(org.eclipse.jdt.core.groovy.tests.search.GenericInferencingTests)  Time elapsed: 0.208 s
09-Dec-2019 00:05:41 testForLoop2(org.eclipse.jdt.core.groovy.tests.search.GenericInferencingTests)  Time elapsed: 0.208 s
09-Dec-2019 00:05:41 testForLoop3(org.eclipse.jdt.core.groovy.tests.search.GenericInferencingTests)  Time elapsed: 0.2 s
09-Dec-2019 00:05:41 testForLoop4(org.eclipse.jdt.core.groovy.tests.search.GenericInferencingTests)  Time elapsed: 0.193 s
09-Dec-2019 00:05:41 testForLoop5(org.eclipse.jdt.core.groovy.tests.search.GenericInferencingTests)  Time elapsed: 0.174 s
09-Dec-2019 00:05:41 testForLoop6(org.eclipse.jdt.core.groovy.tests.search.GenericInferencingTests)  Time elapsed: 0.218 s
09-Dec-2019 00:05:41 testForLoop7(org.eclipse.jdt.core.groovy.tests.search.GenericInferencingTests)  Time elapsed: 0.168 s
09-Dec-2019 00:05:41 testForLoop8(org.eclipse.jdt.core.groovy.tests.search.GenericInferencingTests)  Time elapsed: 0.193 s
09-Dec-2019 00:05:41 testForLoop9(org.eclipse.jdt.core.groovy.tests.search.GenericInferencingTests)  Time elapsed: 0.181 s
09-Dec-2019 00:05:41 testMapOfMaps(org.eclipse.jdt.core.groovy.tests.search.GenericInferencingTests)  Time elapsed: 0.193 s
09-Dec-2019 00:05:41 testList10(org.eclipse.jdt.core.groovy.tests.search.GenericInferencingTests)  Time elapsed: 0.215 s
09-Dec-2019 00:05:41 testList11(org.eclipse.jdt.core.groovy.tests.search.GenericInferencingTests)  Time elapsed: 0.188 s
09-Dec-2019 00:05:41 testList12(org.eclipse.jdt.core.groovy.tests.search.GenericInferencingTests)  Time elapsed: 0.161 s
09-Dec-2019 00:05:41 testList13(org.eclipse.jdt.core.groovy.tests.search.GenericInferencingTests)  Time elapsed: 0.191 s
09-Dec-2019 00:05:41 testForLoop11(org.eclipse.jdt.core.groovy.tests.search.GenericInferencingTests)  Time elapsed: 0.168 s
09-Dec-2019 00:05:41 testForLoop2a(org.eclipse.jdt.core.groovy.tests.search.GenericInferencingTests)  Time elapsed: 0.179 s
09-Dec-2019 00:05:41 testRange1(org.eclipse.jdt.core.groovy.tests.search.GenericInferencingTests)  Time elapsed: 0.16 s
09-Dec-2019 00:05:41 testRange2(org.eclipse.jdt.core.groovy.tests.search.GenericInferencingTests)  Time elapsed: 0.197 s
09-Dec-2019 00:05:41 testClosure1(org.eclipse.jdt.core.groovy.tests.search.GenericInferencingTests)  Time elapsed: 0.161 s
09-Dec-2019 00:05:41 testClosure2(org.eclipse.jdt.core.groovy.tests.search.GenericInferencingTests)  Time elapsed: 0.189 s
09-Dec-2019 00:05:41 testClosure3(org.eclipse.jdt.core.groovy.tests.search.GenericInferencingTests)  Time elapsed: 0.22 s
09-Dec-2019 00:05:41 testClosure4(org.eclipse.jdt.core.groovy.tests.search.GenericInferencingTests)  Time elapsed: 0.156 s
09-Dec-2019 00:05:41 testMapOfList1(org.eclipse.jdt.core.groovy.tests.search.GenericInferencingTests)  Time elapsed: 0.185 s
09-Dec-2019 00:05:41 testMapOfList2(org.eclipse.jdt.core.groovy.tests.search.GenericInferencingTests)  Time elapsed: 0.181 s
09-Dec-2019 00:05:41 testMapOfList3(org.eclipse.jdt.core.groovy.tests.search.GenericInferencingTests)  Time elapsed: 0.222 s
09-Dec-2019 00:05:41 testMapOfList4(org.eclipse.jdt.core.groovy.tests.search.GenericInferencingTests)  Time elapsed: 0.17 s
09-Dec-2019 00:05:41 testMapOfList5(org.eclipse.jdt.core.groovy.tests.search.GenericInferencingTests)  Time elapsed: 0.261 s
09-Dec-2019 00:05:41 testMapOfList6(org.eclipse.jdt.core.groovy.tests.search.GenericInferencingTests)  Time elapsed: 0.225 s
09-Dec-2019 00:05:41 testMapOfList7(org.eclipse.jdt.core.groovy.tests.search.GenericInferencingTests)  Time elapsed: 0.185 s
09-Dec-2019 00:05:41 testGenericsMapper(org.eclipse.jdt.core.groovy.tests.search.GenericsMappingTests)  Time elapsed: 0.118 s
09-Dec-2019 00:05:41 testCompileStatic10(org.eclipse.jdt.core.groovy.tests.search.Groovy20InferencingTests)  Time elapsed: 0.216 s
09-Dec-2019 00:05:41 testCompileStatic11(org.eclipse.jdt.core.groovy.tests.search.Groovy20InferencingTests)  Time elapsed: 0.263 s
09-Dec-2019 00:05:41 testCompileStatic12(org.eclipse.jdt.core.groovy.tests.search.Groovy20InferencingTests)  Time elapsed: 0.228 s
09-Dec-2019 00:05:41 testCompileStatic13(org.eclipse.jdt.core.groovy.tests.search.Groovy20InferencingTests)  Time elapsed: 0.371 s
09-Dec-2019 00:05:41 testCompileStatic14(org.eclipse.jdt.core.groovy.tests.search.Groovy20InferencingTests)  Time elapsed: 0.308 s
09-Dec-2019 00:05:41 testCompileStatic15(org.eclipse.jdt.core.groovy.tests.search.Groovy20InferencingTests)  Time elapsed: 0.201 s
09-Dec-2019 00:05:41 testCompileStatic16(org.eclipse.jdt.core.groovy.tests.search.Groovy20InferencingTests)  Time elapsed: 0.275 s
09-Dec-2019 00:05:41 testCompileStatic17(org.eclipse.jdt.core.groovy.tests.search.Groovy20InferencingTests)  Time elapsed: 0.252 s
09-Dec-2019 00:05:41 testCompileStatic1(org.eclipse.jdt.core.groovy.tests.search.Groovy20InferencingTests)  Time elapsed: 0.229 s
09-Dec-2019 00:05:41 testCompileStatic2(org.eclipse.jdt.core.groovy.tests.search.Groovy20InferencingTests)  Time elapsed: 0.22 s
09-Dec-2019 00:05:41 testCompileStatic3(org.eclipse.jdt.core.groovy.tests.search.Groovy20InferencingTests)  Time elapsed: 0.207 s
09-Dec-2019 00:05:41 testCompileStatic4(org.eclipse.jdt.core.groovy.tests.search.Groovy20InferencingTests)  Time elapsed: 0.327 s
09-Dec-2019 00:05:41 testCompileStatic5(org.eclipse.jdt.core.groovy.tests.search.Groovy20InferencingTests)  Time elapsed: 0.174 s
09-Dec-2019 00:05:41 testCompileStatic6(org.eclipse.jdt.core.groovy.tests.search.Groovy20InferencingTests)  Time elapsed: 0.184 s
09-Dec-2019 00:05:41 testCompileStatic7(org.eclipse.jdt.core.groovy.tests.search.Groovy20InferencingTests)  Time elapsed: 0.183 s
09-Dec-2019 00:05:41 testCompileStatic8(org.eclipse.jdt.core.groovy.tests.search.Groovy20InferencingTests)  Time elapsed: 0.172 s
09-Dec-2019 00:05:41 testCompileStatic9(org.eclipse.jdt.core.groovy.tests.search.Groovy20InferencingTests)  Time elapsed: 0.203 s
09-Dec-2019 00:05:41 testTypeChecked1(org.eclipse.jdt.core.groovy.tests.search.Groovy20InferencingTests)  Time elapsed: 0.191 s
09-Dec-2019 00:05:41 testTypeChecked2(org.eclipse.jdt.core.groovy.tests.search.Groovy20InferencingTests)  Time elapsed: 0.185 s
09-Dec-2019 00:05:41 testTypeChecked3(org.eclipse.jdt.core.groovy.tests.search.Groovy20InferencingTests)  Time elapsed: 0.183 s
09-Dec-2019 00:05:41 testTypeChecked4(org.eclipse.jdt.core.groovy.tests.search.Groovy20InferencingTests)  Time elapsed: 0.202 s
09-Dec-2019 00:05:41 testTypeChecked5(org.eclipse.jdt.core.groovy.tests.search.Groovy20InferencingTests)  Time elapsed: 0.306 s
09-Dec-2019 00:05:41 testTypeChecked6(org.eclipse.jdt.core.groovy.tests.search.Groovy20InferencingTests)  Time elapsed: 0.186 s
09-Dec-2019 00:05:41 testTypeChecked7(org.eclipse.jdt.core.groovy.tests.search.Groovy20InferencingTests)  Time elapsed: 0.202 s
09-Dec-2019 00:05:41 testTypeChecked8(org.eclipse.jdt.core.groovy.tests.search.Groovy20InferencingTests)  Time elapsed: 0.204 s
09-Dec-2019 00:05:41 testDelegatesToResolveStrategy2(org.eclipse.jdt.core.groovy.tests.search.Groovy21InferencingTests)  Time elapsed: 0.261 s
09-Dec-2019 00:05:41 testDelegatesToResolveStrategy3(org.eclipse.jdt.core.groovy.tests.search.Groovy21InferencingTests)  Time elapsed: 0.264 s
09-Dec-2019 00:05:41 testDelegatesToResolveStrategy4(org.eclipse.jdt.core.groovy.tests.search.Groovy21InferencingTests)  Time elapsed: 0.252 s
09-Dec-2019 00:05:41 testDelegatesToTarget2a(org.eclipse.jdt.core.groovy.tests.search.Groovy21InferencingTests)  Time elapsed: 0.257 s
09-Dec-2019 00:05:41 testDelegatesToTypeName3a(org.eclipse.jdt.core.groovy.tests.search.Groovy21InferencingTests)  Time elapsed: 0.266 s
09-Dec-2019 00:05:41 testDelegatesToTypeName3b(org.eclipse.jdt.core.groovy.tests.search.Groovy21InferencingTests)  Time elapsed: 0.226 s
09-Dec-2019 00:05:41 testTypeCheckingExtension(org.eclipse.jdt.core.groovy.tests.search.Groovy21InferencingTests)  Time elapsed: 0.686 s
09-Dec-2019 00:05:41 testDelegatesToTarget1(org.eclipse.jdt.core.groovy.tests.search.Groovy21InferencingTests)  Time elapsed: 0.262 s
09-Dec-2019 00:05:41 testDelegatesToTarget2(org.eclipse.jdt.core.groovy.tests.search.Groovy21InferencingTests)  Time elapsed: 0.251 s
09-Dec-2019 00:05:41 testDelegatesToTarget3(org.eclipse.jdt.core.groovy.tests.search.Groovy21InferencingTests)  Time elapsed: 0.377 s
09-Dec-2019 00:05:41 testDelegatesToTarget4(org.eclipse.jdt.core.groovy.tests.search.Groovy21InferencingTests)  Time elapsed: 0.312 s
09-Dec-2019 00:05:41 testDelegatesToTarget5(org.eclipse.jdt.core.groovy.tests.search.Groovy21InferencingTests)  Time elapsed: 0.317 s
09-Dec-2019 00:05:41 testDelegatesToTarget6(org.eclipse.jdt.core.groovy.tests.search.Groovy21InferencingTests)  Time elapsed: 0.255 s
09-Dec-2019 00:05:41 testDelegatesToValue2(org.eclipse.jdt.core.groovy.tests.search.Groovy21InferencingTests)  Time elapsed: 0.203 s
09-Dec-2019 00:05:41 testDelegatesToValue3(org.eclipse.jdt.core.groovy.tests.search.Groovy21InferencingTests)  Time elapsed: 0.24 s
09-Dec-2019 00:05:41 testDelegatesToValue4(org.eclipse.jdt.core.groovy.tests.search.Groovy21InferencingTests)  Time elapsed: 0.187 s
09-Dec-2019 00:05:41 testDelegatesToValue5(org.eclipse.jdt.core.groovy.tests.search.Groovy21InferencingTests)  Time elapsed: 0.208 s
09-Dec-2019 00:05:41 testDelegatesToValue6(org.eclipse.jdt.core.groovy.tests.search.Groovy21InferencingTests)  Time elapsed: 0.192 s
09-Dec-2019 00:05:41 testDelegatesToTypeName1(org.eclipse.jdt.core.groovy.tests.search.Groovy21InferencingTests)  Time elapsed: 0.195 s
09-Dec-2019 00:05:41 testDelegatesToTypeName2(org.eclipse.jdt.core.groovy.tests.search.Groovy21InferencingTests)  Time elapsed: 0.188 s
09-Dec-2019 00:05:41 testDelegatesToTypeName3(org.eclipse.jdt.core.groovy.tests.search.Groovy21InferencingTests)  Time elapsed: 0.222 s
09-Dec-2019 00:05:41 testDelegatesToValue(org.eclipse.jdt.core.groovy.tests.search.Groovy21InferencingTests)  Time elapsed: 0.182 s
09-Dec-2019 00:05:41 testEnumOverrides(org.eclipse.jdt.core.groovy.tests.search.Groovy21InferencingTests)  Time elapsed: 0.193 s
09-Dec-2019 00:05:41 testEnumOverrides2(org.eclipse.jdt.core.groovy.tests.search.Groovy21InferencingTests)  Time elapsed: 0.231 s
09-Dec-2019 00:05:41 org.eclipse.jdt.core.groovy.tests.search.Groovy25InferencingTests skipped
09-Dec-2019 00:05:41 testFieldAndPropertyWithSameName(org.eclipse.jdt.core.groovy.tests.search.InferencingTests)  Time elapsed: 0.217 s
09-Dec-2019 00:05:41 testObjectMethodOnInterface(org.eclipse.jdt.core.groovy.tests.search.InferencingTests)  Time elapsed: 0.189 s
09-Dec-2019 00:05:41 testLocalWithInitializer1(org.eclipse.jdt.core.groovy.tests.search.InferencingTests)  Time elapsed: 0.174 s
09-Dec-2019 00:05:41 testLocalWithInitializer2(org.eclipse.jdt.core.groovy.tests.search.InferencingTests)  Time elapsed: 0.158 s
09-Dec-2019 00:05:41 testLocalWithInitializer3(org.eclipse.jdt.core.groovy.tests.search.InferencingTests)  Time elapsed: 0.199 s
09-Dec-2019 00:05:41 testLocalWithInitializer4(org.eclipse.jdt.core.groovy.tests.search.InferencingTests)  Time elapsed: 0.166 s
09-Dec-2019 00:05:41 testLocalWithInitializer5(org.eclipse.jdt.core.groovy.tests.search.InferencingTests)  Time elapsed: 0.165 s
09-Dec-2019 00:05:41 testNothingIsUnknown(org.eclipse.jdt.core.groovy.tests.search.InferencingTests)  Time elapsed: 0.171 s
09-Dec-2019 00:05:41 testInnerClass1(org.eclipse.jdt.core.groovy.tests.search.InferencingTests)  Time elapsed: 0.166 s
09-Dec-2019 00:05:41 testInnerClass2(org.eclipse.jdt.core.groovy.tests.search.InferencingTests)  Time elapsed: 0.284 s
09-Dec-2019 00:05:41 testInnerClass3(org.eclipse.jdt.core.groovy.tests.search.InferencingTests)  Time elapsed: 0.218 s
09-Dec-2019 00:05:41 testInnerClass4(org.eclipse.jdt.core.groovy.tests.search.InferencingTests)  Time elapsed: 0.191 s
09-Dec-2019 00:05:41 testInnerClass5(org.eclipse.jdt.core.groovy.tests.search.InferencingTests)  Time elapsed: 0.182 s
09-Dec-2019 00:05:41 testInnerClass6(org.eclipse.jdt.core.groovy.tests.search.InferencingTests)  Time elapsed: 0.236 s
09-Dec-2019 00:05:41 testInnerClass7(org.eclipse.jdt.core.groovy.tests.search.InferencingTests)  Time elapsed: 0.355 s
09-Dec-2019 00:05:41 testInnerClass8(org.eclipse.jdt.core.groovy.tests.search.InferencingTests)  Time elapsed: 0.312 s
09-Dec-2019 00:05:41 testInnerClass9(org.eclipse.jdt.core.groovy.tests.search.InferencingTests)  Time elapsed: 0.246 s
09-Dec-2019 00:05:41 testMethodOverloadsArgumentMatching1(org.eclipse.jdt.core.groovy.tests.search.InferencingTests)  Time elapsed: 0.243 s
09-Dec-2019 00:05:41 testMethodOverloadsArgumentMatching2(org.eclipse.jdt.core.groovy.tests.search.InferencingTests)  Time elapsed: 0.31 s
09-Dec-2019 00:05:41 testMethodOverloadsArgumentMatching3(org.eclipse.jdt.core.groovy.tests.search.InferencingTests)  Time elapsed: 0.195 s
09-Dec-2019 00:05:41 testMethodOverloadsArgumentMatching4(org.eclipse.jdt.core.groovy.tests.search.InferencingTests)  Time elapsed: 0.167 s
09-Dec-2019 00:05:41 testMethodOverloadsArgumentMatching5(org.eclipse.jdt.core.groovy.tests.search.InferencingTests)  Time elapsed: 0.281 s
09-Dec-2019 00:05:41 testMethodOverloadsArgumentMatching6(org.eclipse.jdt.core.groovy.tests.search.InferencingTests)  Time elapsed: 0.216 s
09-Dec-2019 00:05:41 testMethodOverloadsArgumentMatching7(org.eclipse.jdt.core.groovy.tests.search.InferencingTests)  Time elapsed: 0.202 s
09-Dec-2019 00:05:41 testMethodOverloadsArgumentMatching8(org.eclipse.jdt.core.groovy.tests.search.InferencingTests)  Time elapsed: 0.161 s
09-Dec-2019 00:05:41 testMethodOverloadsArgumentMatching9(org.eclipse.jdt.core.groovy.tests.search.InferencingTests)  Time elapsed: 0.172 s
09-Dec-2019 00:05:41 testBoolean1(org.eclipse.jdt.core.groovy.tests.search.InferencingTests)  Time elapsed: 0.184 s
09-Dec-2019 00:05:41 testBoolean2(org.eclipse.jdt.core.groovy.tests.search.InferencingTests)  Time elapsed: 0.232 s
09-Dec-2019 00:05:41 testBoolean3(org.eclipse.jdt.core.groovy.tests.search.InferencingTests)  Time elapsed: 0.224 s
09-Dec-2019 00:05:41 testBoolean4(org.eclipse.jdt.core.groovy.tests.search.InferencingTests)  Time elapsed: 0.216 s
09-Dec-2019 00:05:41 testBoolean5(org.eclipse.jdt.core.groovy.tests.search.InferencingTests)  Time elapsed: 0.201 s
09-Dec-2019 00:05:41 testBoolean6(org.eclipse.jdt.core.groovy.tests.search.InferencingTests)  Time elapsed: 0.167 s
09-Dec-2019 00:05:41 testBoolean7(org.eclipse.jdt.core.groovy.tests.search.InferencingTests)  Time elapsed: 0.224 s
09-Dec-2019 00:05:41 testDeclarationAtBeginningOfMethod(org.eclipse.jdt.core.groovy.tests.search.InferencingTests)  Time elapsed: 0.201 s
09-Dec-2019 00:05:41 testLocalTypeAndDefaultImportCollision(org.eclipse.jdt.core.groovy.tests.search.InferencingTests)  Time elapsed: 0.254 s
09-Dec-2019 00:05:41 testTernaryInitializer(org.eclipse.jdt.core.groovy.tests.search.InferencingTests)  Time elapsed: 0.205 s
09-Dec-2019 00:05:41 testSuperFieldReference1a(org.eclipse.jdt.core.groovy.tests.search.InferencingTests)  Time elapsed: 0.205 s
09-Dec-2019 00:05:41 testSuperFieldReference1b(org.eclipse.jdt.core.groovy.tests.search.InferencingTests)  Time elapsed: 0.297 s
09-Dec-2019 00:05:41 testSuperFieldReference1c(org.eclipse.jdt.core.groovy.tests.search.InferencingTests)  Time elapsed: 0.197 s
09-Dec-2019 00:05:41 testSuperFieldReference1d(org.eclipse.jdt.core.groovy.tests.search.InferencingTests)  Time elapsed: 0.231 s
09-Dec-2019 00:05:41 testSuperFieldReference2a(org.eclipse.jdt.core.groovy.tests.search.InferencingTests)  Time elapsed: 0.193 s
09-Dec-2019 00:05:41 testSuperFieldReference2b(org.eclipse.jdt.core.groovy.tests.search.InferencingTests)  Time elapsed: 0.221 s
09-Dec-2019 00:05:41 testSuperFieldReference2c(org.eclipse.jdt.core.groovy.tests.search.InferencingTests)  Time elapsed: 0.181 s
09-Dec-2019 00:05:41 testSuperFieldReference2d(org.eclipse.jdt.core.groovy.tests.search.InferencingTests)  Time elapsed: 0.318 s
09-Dec-2019 00:05:41 testSuperFieldReference3a(org.eclipse.jdt.core.groovy.tests.search.InferencingTests)  Time elapsed: 0.206 s
09-Dec-2019 00:05:41 testSuperFieldReference3b(org.eclipse.jdt.core.groovy.tests.search.InferencingTests)  Time elapsed: 0.228 s
09-Dec-2019 00:05:41 testSuperFieldReference3c(org.eclipse.jdt.core.groovy.tests.search.InferencingTests)  Time elapsed: 0.195 s
09-Dec-2019 00:05:41 testSuperFieldReference3d(org.eclipse.jdt.core.groovy.tests.search.InferencingTests)  Time elapsed: 0.208 s
09-Dec-2019 00:05:41 testSuperFieldReference5a(org.eclipse.jdt.core.groovy.tests.search.InferencingTests)  Time elapsed: 0.177 s
09-Dec-2019 00:05:41 testSuperFieldReference5b(org.eclipse.jdt.core.groovy.tests.search.InferencingTests)  Time elapsed: 0.195 s
09-Dec-2019 00:05:41 testSpecialConstructor1(org.eclipse.jdt.core.groovy.tests.search.InferencingTests)  Time elapsed: 0.126 s
09-Dec-2019 00:05:41 testSpecialConstructor2(org.eclipse.jdt.core.groovy.tests.search.InferencingTests)  Time elapsed: 0.175 s
09-Dec-2019 00:05:41 testInnerClass10(org.eclipse.jdt.core.groovy.tests.search.InferencingTests)  Time elapsed: 0.234 s
09-Dec-2019 00:05:41 testInnerClass11(org.eclipse.jdt.core.groovy.tests.search.InferencingTests)  Time elapsed: 0.387 s
09-Dec-2019 00:05:41 testMultiDecl10(org.eclipse.jdt.core.groovy.tests.search.InferencingTests)  Time elapsed: 0.234 s
09-Dec-2019 00:05:41 testMultiDecl11(org.eclipse.jdt.core.groovy.tests.search.InferencingTests)  Time elapsed: 0.374 s
09-Dec-2019 00:05:41 testMultiDecl12(org.eclipse.jdt.core.groovy.tests.search.InferencingTests)  Time elapsed: 0.254 s
09-Dec-2019 00:05:41 testMultiDecl13(org.eclipse.jdt.core.groovy.tests.search.InferencingTests)  Time elapsed: 0.218 s
09-Dec-2019 00:05:41 testAsExpression1(org.eclipse.jdt.core.groovy.tests.search.InferencingTests)  Time elapsed: 0.183 s
09-Dec-2019 00:05:41 testAsExpression2(org.eclipse.jdt.core.groovy.tests.search.InferencingTests)  Time elapsed: 0.218 s
09-Dec-2019 00:05:41 testSuperClassMethod1(org.eclipse.jdt.core.groovy.tests.search.InferencingTests)  Time elapsed: 0.184 s
09-Dec-2019 00:05:41 testSuperClassMethod2(org.eclipse.jdt.core.groovy.tests.search.InferencingTests)  Time elapsed: 0.182 s
09-Dec-2019 00:05:41 testSuperClassMethod3(org.eclipse.jdt.core.groovy.tests.search.InferencingTests)  Time elapsed: 0.193 s
09-Dec-2019 00:05:41 testSuperClassMethod4(org.eclipse.jdt.core.groovy.tests.search.InferencingTests)  Time elapsed: 0.178 s
09-Dec-2019 00:05:41 testSuperClassMethod5(org.eclipse.jdt.core.groovy.tests.search.InferencingTests)  Time elapsed: 0.251 s
09-Dec-2019 00:05:41 testElvisInitializer(org.eclipse.jdt.core.groovy.tests.search.InferencingTests)  Time elapsed: 0.167 s
09-Dec-2019 00:05:41 testSuperPropertyReference1(org.eclipse.jdt.core.groovy.tests.search.InferencingTests)  Time elapsed: 0.169 s
09-Dec-2019 00:05:41 testSuperPropertyReference2(org.eclipse.jdt.core.groovy.tests.search.InferencingTests)  Time elapsed: 0.183 s
09-Dec-2019 00:05:41 testSuperPropertyReference3(org.eclipse.jdt.core.groovy.tests.search.InferencingTests)  Time elapsed: 0.225 s
09-Dec-2019 00:05:41 testSuperPropertyReference4(org.eclipse.jdt.core.groovy.tests.search.InferencingTests)  Time elapsed: 0.179 s
09-Dec-2019 00:05:41 testSuperPropertyReference5(org.eclipse.jdt.core.groovy.tests.search.InferencingTests)  Time elapsed: 0.178 s
09-Dec-2019 00:05:41 testRangeExpression1(org.eclipse.jdt.core.groovy.tests.search.InferencingTests)  Time elapsed: 0.185 s
09-Dec-2019 00:05:41 testRangeExpression2(org.eclipse.jdt.core.groovy.tests.search.InferencingTests)  Time elapsed: 0.197 s
09-Dec-2019 00:05:41 testRangeExpression3(org.eclipse.jdt.core.groovy.tests.search.InferencingTests)  Time elapsed: 0.218 s
09-Dec-2019 00:05:41 testRangeExpression4(org.eclipse.jdt.core.groovy.tests.search.InferencingTests)  Time elapsed: 0.189 s
09-Dec-2019 00:05:41 testRangeExpression5(org.eclipse.jdt.core.groovy.tests.search.InferencingTests)  Time elapsed: 0.187 s
09-Dec-2019 00:05:41 testRangeExpression6(org.eclipse.jdt.core.groovy.tests.search.InferencingTests)  Time elapsed: 0.203 s
09-Dec-2019 00:05:41 testSpread10(org.eclipse.jdt.core.groovy.tests.search.InferencingTests)  Time elapsed: 0.219 s
09-Dec-2019 00:05:41 testSpread11(org.eclipse.jdt.core.groovy.tests.search.InferencingTests)  Time elapsed: 0.226 s
09-Dec-2019 00:05:41 testSpread12(org.eclipse.jdt.core.groovy.tests.search.InferencingTests)  Time elapsed: 0.197 s
09-Dec-2019 00:05:41 testSpread13(org.eclipse.jdt.core.groovy.tests.search.InferencingTests)  Time elapsed: 0.231 s
09-Dec-2019 00:05:41 testSpread14(org.eclipse.jdt.core.groovy.tests.search.InferencingTests)  Time elapsed: 0.198 s
09-Dec-2019 00:05:41 testSpread15(org.eclipse.jdt.core.groovy.tests.search.InferencingTests)  Time elapsed: 0.218 s
09-Dec-2019 00:05:41 testSpread16(org.eclipse.jdt.core.groovy.tests.search.InferencingTests)  Time elapsed: 0.211 s
09-Dec-2019 00:05:41 testSpread17(org.eclipse.jdt.core.groovy.tests.search.InferencingTests)  Time elapsed: 0.22 s
09-Dec-2019 00:05:41 testStaticThisAndSuper1(org.eclipse.jdt.core.groovy.tests.search.InferencingTests)  Time elapsed: 0.28 s
09-Dec-2019 00:05:41 testStaticThisAndSuper2(org.eclipse.jdt.core.groovy.tests.search.InferencingTests)  Time elapsed: 0.246 s
09-Dec-2019 00:05:41 testMethodOverloadsArgumentMatching4a(org.eclipse.jdt.core.groovy.tests.search.InferencingTests)  Time elapsed: 0.249 s
09-Dec-2019 00:05:41 testMethodOverloadsArgumentMatching4b(org.eclipse.jdt.core.groovy.tests.search.InferencingTests)  Time elapsed: 0.198 s
09-Dec-2019 00:05:41 testMethodOverloadsArgumentMatching5a(org.eclipse.jdt.core.groovy.tests.search.InferencingTests)  Time elapsed: 0.192 s
09-Dec-2019 00:05:41 testMethodOverloadsArgumentMatching5b(org.eclipse.jdt.core.groovy.tests.search.InferencingTests)  Time elapsed: 0.19 s
09-Dec-2019 00:05:41 testMethodOverloadsArgumentMatching6a(org.eclipse.jdt.core.groovy.tests.search.InferencingTests)  Time elapsed: 1.333 s
09-Dec-2019 00:05:41 testMethodOverloadsArgumentMatching6b(org.eclipse.jdt.core.groovy.tests.search.InferencingTests)  Time elapsed: 0.203 s
09-Dec-2019 00:05:41 testMethodOverloadsArgumentMatching8a(org.eclipse.jdt.core.groovy.tests.search.InferencingTests)  Time elapsed: 0.228 s
09-Dec-2019 00:05:41 testConstructor1(org.eclipse.jdt.core.groovy.tests.search.InferencingTests)  Time elapsed: 0.328 s
09-Dec-2019 00:05:41 testConstructor2(org.eclipse.jdt.core.groovy.tests.search.InferencingTests)  Time elapsed: 0.375 s
09-Dec-2019 00:05:41 testConstructor3(org.eclipse.jdt.core.groovy.tests.search.InferencingTests)  Time elapsed: 0.232 s
09-Dec-2019 00:05:41 testConstructor4(org.eclipse.jdt.core.groovy.tests.search.InferencingTests)  Time elapsed: 0.333 s
09-Dec-2019 00:05:41 testConstructor5(org.eclipse.jdt.core.groovy.tests.search.InferencingTests)  Time elapsed: 0.4 s
09-Dec-2019 00:05:41 testConstructor6(org.eclipse.jdt.core.groovy.tests.search.InferencingTests)  Time elapsed: 0.373 s
09-Dec-2019 00:05:41 testInterfaceMethodsAsProperty(org.eclipse.jdt.core.groovy.tests.search.InferencingTests)  Time elapsed: 0.266 s
09-Dec-2019 00:05:41 testStaticMethod1(org.eclipse.jdt.core.groovy.tests.search.InferencingTests)  Time elapsed: 0.172 s
09-Dec-2019 00:05:41 testStaticMethod2(org.eclipse.jdt.core.groovy.tests.search.InferencingTests)  Time elapsed: 0.193 s
09-Dec-2019 00:05:41 testStaticMethod3(org.eclipse.jdt.core.groovy.tests.search.InferencingTests)  Time elapsed: 0.12 s
09-Dec-2019 00:05:41 testStaticMethod4(org.eclipse.jdt.core.groovy.tests.search.InferencingTests)  Time elapsed: 0.157 s
09-Dec-2019 00:05:41 testStaticMethod5(org.eclipse.jdt.core.groovy.tests.search.InferencingTests)  Time elapsed: 0.13 s
09-Dec-2019 00:05:41 testStaticMethod6(org.eclipse.jdt.core.groovy.tests.search.InferencingTests)  Time elapsed: 0.122 s
09-Dec-2019 00:05:41 testStaticMethod7(org.eclipse.jdt.core.groovy.tests.search.InferencingTests)  Time elapsed: 0.206 s
09-Dec-2019 00:05:41 testStaticMethod8(org.eclipse.jdt.core.groovy.tests.search.InferencingTests)  Time elapsed: 0.183 s
09-Dec-2019 00:05:41 testStaticMethod9(org.eclipse.jdt.core.groovy.tests.search.InferencingTests)  Time elapsed: 0.189 s
09-Dec-2019 00:05:41 testClassWithInitializer1(org.eclipse.jdt.core.groovy.tests.search.InferencingTests)  Time elapsed: 0.174 s
09-Dec-2019 00:05:41 testClassWithInitializer2(org.eclipse.jdt.core.groovy.tests.search.InferencingTests)  Time elapsed: 0.196 s
09-Dec-2019 00:05:41 testClassWithInitializer3(org.eclipse.jdt.core.groovy.tests.search.InferencingTests)  Time elapsed: 0.874 s
09-Dec-2019 00:05:41 testPostfix(org.eclipse.jdt.core.groovy.tests.search.InferencingTests)  Time elapsed: 0.199 s
09-Dec-2019 00:05:41 testSuperClassMethod4a(org.eclipse.jdt.core.groovy.tests.search.InferencingTests)  Time elapsed: 0.17 s
09-Dec-2019 00:05:41 testSuperClassMethod4b(org.eclipse.jdt.core.groovy.tests.search.InferencingTests)  Time elapsed: 0.172 s
09-Dec-2019 00:05:41 testSuperClassMethod4c(org.eclipse.jdt.core.groovy.tests.search.InferencingTests)  Time elapsed: 0.181 s
09-Dec-2019 00:05:41 testSuperClassMethod5a(org.eclipse.jdt.core.groovy.tests.search.InferencingTests)  Time elapsed: 1.011 s
09-Dec-2019 00:05:41 testSuperClassMethod5b(org.eclipse.jdt.core.groovy.tests.search.InferencingTests)  Time elapsed: 0.212 s
09-Dec-2019 00:05:41 testListSort1(org.eclipse.jdt.core.groovy.tests.search.InferencingTests)  Time elapsed: 0.233 s
09-Dec-2019 00:05:41 testListSort2(org.eclipse.jdt.core.groovy.tests.search.InferencingTests)  Time elapsed: 0.258 s
09-Dec-2019 00:05:41 testListSort3(org.eclipse.jdt.core.groovy.tests.search.InferencingTests)  Time elapsed: 0.889 s
09-Dec-2019 00:05:41 testLocalVar1(org.eclipse.jdt.core.groovy.tests.search.InferencingTests)  Time elapsed: 0.19 s
09-Dec-2019 00:05:41 testLocalVar2(org.eclipse.jdt.core.groovy.tests.search.InferencingTests)  Time elapsed: 0.189 s
09-Dec-2019 00:05:41 testLocalVar3(org.eclipse.jdt.core.groovy.tests.search.InferencingTests)  Time elapsed: 0.201 s
09-Dec-2019 00:05:41 testLocalVar4(org.eclipse.jdt.core.groovy.tests.search.InferencingTests)  Time elapsed: 0.2 s
09-Dec-2019 00:05:41 testLocalVar5(org.eclipse.jdt.core.groovy.tests.search.InferencingTests)  Time elapsed: 0.811 s
09-Dec-2019 00:05:41 testLocalVar6(org.eclipse.jdt.core.groovy.tests.search.InferencingTests)  Time elapsed: 0.168 s
09-Dec-2019 00:05:41 testLocalVar7(org.eclipse.jdt.core.groovy.tests.search.InferencingTests)  Time elapsed: 0.195 s
09-Dec-2019 00:05:41 testLocalVar8(org.eclipse.jdt.core.groovy.tests.search.InferencingTests)  Time elapsed: 0.184 s
09-Dec-2019 00:05:41 testLocalVar9(org.eclipse.jdt.core.groovy.tests.search.InferencingTests)  Time elapsed: 1.324 s
09-Dec-2019 00:05:41 testIndirectInterfaceMethod(org.eclipse.jdt.core.groovy.tests.search.InferencingTests)  Time elapsed: 0.254 s
09-Dec-2019 00:05:41 testMapLiteral(org.eclipse.jdt.core.groovy.tests.search.InferencingTests)  Time elapsed: 0.199 s
09-Dec-2019 00:05:41 testListRemove(org.eclipse.jdt.core.groovy.tests.search.InferencingTests)  Time elapsed: 0.199 s
09-Dec-2019 00:05:41 testCategoryMethodAsProperty(org.eclipse.jdt.core.groovy.tests.search.InferencingTests)  Time elapsed: 0.194 s
09-Dec-2019 00:05:41 testNothingIsUnknownWithCategories(org.eclipse.jdt.core.groovy.tests.search.InferencingTests)  Time elapsed: 0.747 s
09-Dec-2019 00:05:41 testImplicitVar1(org.eclipse.jdt.core.groovy.tests.search.InferencingTests)  Time elapsed: 0.191 s
09-Dec-2019 00:05:41 testImplicitVar2(org.eclipse.jdt.core.groovy.tests.search.InferencingTests)  Time elapsed: 0.214 s
09-Dec-2019 00:05:41 testImplicitVar3(org.eclipse.jdt.core.groovy.tests.search.InferencingTests)  Time elapsed: 0.237 s
09-Dec-2019 00:05:41 testImplicitVar4(org.eclipse.jdt.core.groovy.tests.search.InferencingTests)  Time elapsed: 0.194 s
09-Dec-2019 00:05:41 testImplicitVar5(org.eclipse.jdt.core.groovy.tests.search.InferencingTests)  Time elapsed: 0.955 s
09-Dec-2019 00:05:41 testImplicitVar6(org.eclipse.jdt.core.groovy.tests.search.InferencingTests)  Time elapsed: 0.174 s
09-Dec-2019 00:05:41 testImplicitVar7(org.eclipse.jdt.core.groovy.tests.search.InferencingTests)  Time elapsed: 0.171 s
09-Dec-2019 00:05:41 testClassLiteral1(org.eclipse.jdt.core.groovy.tests.search.InferencingTests)  Time elapsed: 0.198 s
09-Dec-2019 00:05:41 testClassLiteral2(org.eclipse.jdt.core.groovy.tests.search.InferencingTests)  Time elapsed: 0.193 s
09-Dec-2019 00:05:41 testClassLiteral3(org.eclipse.jdt.core.groovy.tests.search.InferencingTests)  Time elapsed: 1.008 s
09-Dec-2019 00:05:41 testClassLiteral4(org.eclipse.jdt.core.groovy.tests.search.InferencingTests)  Time elapsed: 0.23 s
09-Dec-2019 00:05:41 testClassLiteral5(org.eclipse.jdt.core.groovy.tests.search.InferencingTests)  Time elapsed: 0.178 s
09-Dec-2019 00:05:41 testInstanceOf10(org.eclipse.jdt.core.groovy.tests.search.InferencingTests)  Time elapsed: 0.404 s
09-Dec-2019 00:05:41 testInstanceOf11(org.eclipse.jdt.core.groovy.tests.search.InferencingTests)  Time elapsed: 1.343 s
09-Dec-2019 00:05:41 testInstanceOf12(org.eclipse.jdt.core.groovy.tests.search.InferencingTests)  Time elapsed: 0.381 s
09-Dec-2019 00:05:41 testInstanceOf1a(org.eclipse.jdt.core.groovy.tests.search.InferencingTests)  Time elapsed: 1.46 s
09-Dec-2019 00:05:41 testInstanceOf1b(org.eclipse.jdt.core.groovy.tests.search.InferencingTests)  Time elapsed: 0.391 s
09-Dec-2019 00:05:41 testInstanceOf2a(org.eclipse.jdt.core.groovy.tests.search.InferencingTests) skipped
09-Dec-2019 00:05:41 testInstanceOf3a(org.eclipse.jdt.core.groovy.tests.search.InferencingTests) skipped
09-Dec-2019 00:05:41 testStaticMethod10(org.eclipse.jdt.core.groovy.tests.search.InferencingTests)  Time elapsed: 1.107 s
09-Dec-2019 00:05:41 testStaticMethod11(org.eclipse.jdt.core.groovy.tests.search.InferencingTests)  Time elapsed: 0.236 s
09-Dec-2019 00:05:41 testStaticMethod12(org.eclipse.jdt.core.groovy.tests.search.InferencingTests)  Time elapsed: 0.239 s
09-Dec-2019 00:05:41 testThisInInnerClass(org.eclipse.jdt.core.groovy.tests.search.InferencingTests)  Time elapsed: 0.241 s
09-Dec-2019 00:05:41 testStaticImports1(org.eclipse.jdt.core.groovy.tests.search.InferencingTests)  Time elapsed: 1.076 s
09-Dec-2019 00:05:41 testStaticImports2(org.eclipse.jdt.core.groovy.tests.search.InferencingTests)  Time elapsed: 0.212 s
09-Dec-2019 00:05:41 testStaticImports3(org.eclipse.jdt.core.groovy.tests.search.InferencingTests)  Time elapsed: 0.22 s
09-Dec-2019 00:05:41 testStaticImports4(org.eclipse.jdt.core.groovy.tests.search.InferencingTests)  Time elapsed: 0.205 s
09-Dec-2019 00:05:41 testInstanceOf10a(org.eclipse.jdt.core.groovy.tests.search.InferencingTests) skipped
09-Dec-2019 00:05:41 testMultiDecl1(org.eclipse.jdt.core.groovy.tests.search.InferencingTests)  Time elapsed: 0.873 s
09-Dec-2019 00:05:41 testMultiDecl2(org.eclipse.jdt.core.groovy.tests.search.InferencingTests)  Time elapsed: 0.247 s
09-Dec-2019 00:05:41 testMultiDecl3(org.eclipse.jdt.core.groovy.tests.search.InferencingTests)  Time elapsed: 0.24 s
09-Dec-2019 00:05:41 testMultiDecl4(org.eclipse.jdt.core.groovy.tests.search.InferencingTests)  Time elapsed: 0.927 s
09-Dec-2019 00:05:41 testMultiDecl6(org.eclipse.jdt.core.groovy.tests.search.InferencingTests)  Time elapsed: 0.228 s
09-Dec-2019 00:05:41 testMultiDecl7(org.eclipse.jdt.core.groovy.tests.search.InferencingTests)  Time elapsed: 0.237 s
09-Dec-2019 00:05:41 testMultiDecl8(org.eclipse.jdt.core.groovy.tests.search.InferencingTests)  Time elapsed: 0.256 s
09-Dec-2019 00:05:41 testMultiDecl9(org.eclipse.jdt.core.groovy.tests.search.InferencingTests)  Time elapsed: 1.025 s
09-Dec-2019 00:05:41 testLocalMethod1(org.eclipse.jdt.core.groovy.tests.search.InferencingTests)  Time elapsed: 0.224 s
09-Dec-2019 00:05:41 testLocalMethod2(org.eclipse.jdt.core.groovy.tests.search.InferencingTests)  Time elapsed: 0.196 s
09-Dec-2019 00:05:41 testLocalMethod3(org.eclipse.jdt.core.groovy.tests.search.InferencingTests)  Time elapsed: 0.188 s
09-Dec-2019 00:05:41 testLocalMethod4(org.eclipse.jdt.core.groovy.tests.search.InferencingTests)  Time elapsed: 1.609 s
09-Dec-2019 00:05:41 testLocalMethod5(org.eclipse.jdt.core.groovy.tests.search.InferencingTests)  Time elapsed: 0.224 s
09-Dec-2019 00:05:41 testLocalVar10(org.eclipse.jdt.core.groovy.tests.search.InferencingTests)  Time elapsed: 0.205 s
09-Dec-2019 00:05:41 testLocalVar11(org.eclipse.jdt.core.groovy.tests.search.InferencingTests)  Time elapsed: 0.208 s
09-Dec-2019 00:05:41 testLocalVar12(org.eclipse.jdt.core.groovy.tests.search.InferencingTests)  Time elapsed: 1.009 s
09-Dec-2019 00:05:41 testLocalVar13(org.eclipse.jdt.core.groovy.tests.search.InferencingTests)  Time elapsed: 0.175 s
09-Dec-2019 00:05:41 testLocalVar14(org.eclipse.jdt.core.groovy.tests.search.InferencingTests)  Time elapsed: 0.186 s
09-Dec-2019 00:05:41 testLocalVar15(org.eclipse.jdt.core.groovy.tests.search.InferencingTests)  Time elapsed: 0.371 s
09-Dec-2019 00:05:41 testLocalVar16(org.eclipse.jdt.core.groovy.tests.search.InferencingTests)  Time elapsed: 1.209 s
09-Dec-2019 00:05:41 testLocalVar17(org.eclipse.jdt.core.groovy.tests.search.InferencingTests)  Time elapsed: 0.336 s
09-Dec-2019 00:05:41 testLocalVar18(org.eclipse.jdt.core.groovy.tests.search.InferencingTests)  Time elapsed: 1.056 s
09-Dec-2019 00:05:41 testLocalVar19(org.eclipse.jdt.core.groovy.tests.search.InferencingTests)  Time elapsed: 0.336 s
09-Dec-2019 00:05:41 testLocalVar20(org.eclipse.jdt.core.groovy.tests.search.InferencingTests)  Time elapsed: 0.316 s
09-Dec-2019 00:05:41 testLocalVar21(org.eclipse.jdt.core.groovy.tests.search.InferencingTests)  Time elapsed: 1.048 s
09-Dec-2019 00:05:41 testLocalVar22(org.eclipse.jdt.core.groovy.tests.search.InferencingTests)  Time elapsed: 0.499 s
09-Dec-2019 00:05:41 testLocalVar23(org.eclipse.jdt.core.groovy.tests.search.InferencingTests)  Time elapsed: 1.043 s
09-Dec-2019 00:05:41 testLocalVar24(org.eclipse.jdt.core.groovy.tests.search.InferencingTests)  Time elapsed: 0.372 s
09-Dec-2019 00:05:41 testLocalVar25(org.eclipse.jdt.core.groovy.tests.search.InferencingTests)  Time elapsed: 1.157 s
09-Dec-2019 00:05:41 testLocalVar26(org.eclipse.jdt.core.groovy.tests.search.InferencingTests)  Time elapsed: 0.231 s
09-Dec-2019 00:05:41 testLocalVar27(org.eclipse.jdt.core.groovy.tests.search.InferencingTests)  Time elapsed: 0.207 s
09-Dec-2019 00:05:41 testLocalVar28(org.eclipse.jdt.core.groovy.tests.search.InferencingTests)  Time elapsed: 0.201 s
09-Dec-2019 00:05:41 testNoGString(org.eclipse.jdt.core.groovy.tests.search.InferencingTests)  Time elapsed: 1.002 s
09-Dec-2019 00:05:41 testObjectMethodOnInterfaceAsProperty(org.eclipse.jdt.core.groovy.tests.search.InferencingTests)  Time elapsed: 0.189 s
09-Dec-2019 00:05:41 testMatcher1(org.eclipse.jdt.core.groovy.tests.search.InferencingTests)  Time elapsed: 0.184 s
09-Dec-2019 00:05:41 testMatcher2(org.eclipse.jdt.core.groovy.tests.search.InferencingTests)  Time elapsed: 0.199 s
09-Dec-2019 00:05:41 testCatchBlock1(org.eclipse.jdt.core.groovy.tests.search.InferencingTests)  Time elapsed: 0.877 s
09-Dec-2019 00:05:41 testCatchBlock2(org.eclipse.jdt.core.groovy.tests.search.InferencingTests)  Time elapsed: 0.194 s
09-Dec-2019 00:05:41 testCatchBlock3(org.eclipse.jdt.core.groovy.tests.search.InferencingTests)  Time elapsed: 0.207 s
09-Dec-2019 00:05:41 testCatchBlock4(org.eclipse.jdt.core.groovy.tests.search.InferencingTests)  Time elapsed: 0.205 s
09-Dec-2019 00:05:41 testCatchBlock5(org.eclipse.jdt.core.groovy.tests.search.InferencingTests)  Time elapsed: 0.196 s
09-Dec-2019 00:05:41 testInterfaceMethodAsProperty2(org.eclipse.jdt.core.groovy.tests.search.InferencingTests)  Time elapsed: 0.916 s
09-Dec-2019 00:05:41 testInterfaceMethodAsProperty3(org.eclipse.jdt.core.groovy.tests.search.InferencingTests)  Time elapsed: 0.251 s
09-Dec-2019 00:05:41 testGetAt1(org.eclipse.jdt.core.groovy.tests.search.InferencingTests)  Time elapsed: 0.244 s
09-Dec-2019 00:05:41 testGetAt2(org.eclipse.jdt.core.groovy.tests.search.InferencingTests)  Time elapsed: 1.004 s
09-Dec-2019 00:05:41 testGetAt3(org.eclipse.jdt.core.groovy.tests.search.InferencingTests)  Time elapsed: 0.196 s
09-Dec-2019 00:05:41 testGetAt4(org.eclipse.jdt.core.groovy.tests.search.InferencingTests)  Time elapsed: 0.193 s
09-Dec-2019 00:05:41 testGetAt5(org.eclipse.jdt.core.groovy.tests.search.InferencingTests)  Time elapsed: 0.227 s
09-Dec-2019 00:05:41 testGetAt6(org.eclipse.jdt.core.groovy.tests.search.InferencingTests)  Time elapsed: 1.148 s
09-Dec-2019 00:05:41 testGetAt7(org.eclipse.jdt.core.groovy.tests.search.InferencingTests)  Time elapsed: 0.247 s
09-Dec-2019 00:05:41 testGetAt8(org.eclipse.jdt.core.groovy.tests.search.InferencingTests) skipped
09-Dec-2019 00:05:41 testGetAt9(org.eclipse.jdt.core.groovy.tests.search.InferencingTests) skipped
09-Dec-2019 00:05:41 testFieldWithInitializer1(org.eclipse.jdt.core.groovy.tests.search.InferencingTests)  Time elapsed: 0.202 s
09-Dec-2019 00:05:41 testFieldWithInitializer2(org.eclipse.jdt.core.groovy.tests.search.InferencingTests)  Time elapsed: 1.128 s
09-Dec-2019 00:05:41 testNested1(org.eclipse.jdt.core.groovy.tests.search.InferencingTests)  Time elapsed: 0.311 s
09-Dec-2019 00:05:41 testNested2(org.eclipse.jdt.core.groovy.tests.search.InferencingTests)  Time elapsed: 0.196 s
09-Dec-2019 00:05:41 testNested3(org.eclipse.jdt.core.groovy.tests.search.InferencingTests)  Time elapsed: 0.192 s
09-Dec-2019 00:05:41 testNested4(org.eclipse.jdt.core.groovy.tests.search.InferencingTests)  Time elapsed: 1.058 s
09-Dec-2019 00:05:41 testIndirectInterfaceConstant(org.eclipse.jdt.core.groovy.tests.search.InferencingTests)  Time elapsed: 0.269 s
09-Dec-2019 00:05:41 testInstanceOf1(org.eclipse.jdt.core.groovy.tests.search.InferencingTests)  Time elapsed: 0.315 s
09-Dec-2019 00:05:41 testInstanceOf2(org.eclipse.jdt.core.groovy.tests.search.InferencingTests)  Time elapsed: 1.119 s
09-Dec-2019 00:05:41 testInstanceOf3(org.eclipse.jdt.core.groovy.tests.search.InferencingTests)  Time elapsed: 0.411 s
09-Dec-2019 00:05:41 testInstanceOf4(org.eclipse.jdt.core.groovy.tests.search.InferencingTests)  Time elapsed: 1.214 s
09-Dec-2019 00:05:41 testInstanceOf5(org.eclipse.jdt.core.groovy.tests.search.InferencingTests)  Time elapsed: 1.106 s
09-Dec-2019 00:05:41 testInstanceOf6(org.eclipse.jdt.core.groovy.tests.search.InferencingTests)  Time elapsed: 0.37 s
09-Dec-2019 00:05:41 testInstanceOf7(org.eclipse.jdt.core.groovy.tests.search.InferencingTests)  Time elapsed: 1.11 s
09-Dec-2019 00:05:41 testInstanceOf8(org.eclipse.jdt.core.groovy.tests.search.InferencingTests)  Time elapsed: 0.361 s
09-Dec-2019 00:05:41 testInstanceOf9(org.eclipse.jdt.core.groovy.tests.search.InferencingTests)  Time elapsed: 1.003 s
09-Dec-2019 00:05:41 testAnonInner1(org.eclipse.jdt.core.groovy.tests.search.InferencingTests)  Time elapsed: 0.21 s
09-Dec-2019 00:05:41 testAnonInner2(org.eclipse.jdt.core.groovy.tests.search.InferencingTests)  Time elapsed: 0.205 s
09-Dec-2019 00:05:41 testAnonInner3(org.eclipse.jdt.core.groovy.tests.search.InferencingTests)  Time elapsed: 0.201 s
09-Dec-2019 00:05:41 testAnonInner4(org.eclipse.jdt.core.groovy.tests.search.InferencingTests)  Time elapsed: 1.001 s
09-Dec-2019 00:05:41 testAnonInner5(org.eclipse.jdt.core.groovy.tests.search.InferencingTests)  Time elapsed: 0.192 s
09-Dec-2019 00:05:41 testAnonInner6(org.eclipse.jdt.core.groovy.tests.search.InferencingTests)  Time elapsed: 0.114 s
09-Dec-2019 00:05:41 testAnonInner7(org.eclipse.jdt.core.groovy.tests.search.InferencingTests)  Time elapsed: 0.262 s
09-Dec-2019 00:05:41 testAnonInner8(org.eclipse.jdt.core.groovy.tests.search.InferencingTests)  Time elapsed: 1.154 s
09-Dec-2019 00:05:41 testNumber1(org.eclipse.jdt.core.groovy.tests.search.InferencingTests)  Time elapsed: 0.215 s
09-Dec-2019 00:05:41 testNumber2(org.eclipse.jdt.core.groovy.tests.search.InferencingTests)  Time elapsed: 0.198 s
09-Dec-2019 00:05:41 testNumber3(org.eclipse.jdt.core.groovy.tests.search.InferencingTests)  Time elapsed: 1.065 s
09-Dec-2019 00:05:41 testNumber4(org.eclipse.jdt.core.groovy.tests.search.InferencingTests)  Time elapsed: 0.217 s
09-Dec-2019 00:05:41 testNumber5(org.eclipse.jdt.core.groovy.tests.search.InferencingTests)  Time elapsed: 0.272 s
09-Dec-2019 00:05:41 testNumber6(org.eclipse.jdt.core.groovy.tests.search.InferencingTests)  Time elapsed: 0.212 s
09-Dec-2019 00:05:41 testSpread1(org.eclipse.jdt.core.groovy.tests.search.InferencingTests)  Time elapsed: 0.883 s
09-Dec-2019 00:05:41 testSpread2(org.eclipse.jdt.core.groovy.tests.search.InferencingTests)  Time elapsed: 0.183 s
09-Dec-2019 00:05:41 testSpread3(org.eclipse.jdt.core.groovy.tests.search.InferencingTests)  Time elapsed: 0.194 s
09-Dec-2019 00:05:41 testSpread4(org.eclipse.jdt.core.groovy.tests.search.InferencingTests)  Time elapsed: 0.201 s
09-Dec-2019 00:05:41 testSpread5(org.eclipse.jdt.core.groovy.tests.search.InferencingTests)  Time elapsed: 1.059 s
09-Dec-2019 00:05:41 testSpread6(org.eclipse.jdt.core.groovy.tests.search.InferencingTests)  Time elapsed: 0.229 s
09-Dec-2019 00:05:41 testSpread7(org.eclipse.jdt.core.groovy.tests.search.InferencingTests)  Time elapsed: 0.275 s
09-Dec-2019 00:05:41 testSpread8(org.eclipse.jdt.core.groovy.tests.search.InferencingTests)  Time elapsed: 1.09 s
09-Dec-2019 00:05:41 testSpread9(org.eclipse.jdt.core.groovy.tests.search.InferencingTests)  Time elapsed: 0.195 s
09-Dec-2019 00:05:41 testPattern1(org.eclipse.jdt.core.groovy.tests.search.InferencingTests)  Time elapsed: 0.226 s
09-Dec-2019 00:05:41 testPattern2(org.eclipse.jdt.core.groovy.tests.search.InferencingTests)  Time elapsed: 0.194 s
09-Dec-2019 00:05:41 testClassReference2a(org.eclipse.jdt.core.groovy.tests.search.InferencingTests)  Time elapsed: 1.275 s
09-Dec-2019 00:05:41 testClassReference3a(org.eclipse.jdt.core.groovy.tests.search.InferencingTests)  Time elapsed: 0.261 s
09-Dec-2019 00:05:41 testClassReference4a(org.eclipse.jdt.core.groovy.tests.search.InferencingTests)  Time elapsed: 0.246 s
09-Dec-2019 00:05:41 testClassReference4b(org.eclipse.jdt.core.groovy.tests.search.InferencingTests)  Time elapsed: 1.347 s
09-Dec-2019 00:05:41 testString1(org.eclipse.jdt.core.groovy.tests.search.InferencingTests)  Time elapsed: 0.191 s
09-Dec-2019 00:05:41 testString2(org.eclipse.jdt.core.groovy.tests.search.InferencingTests)  Time elapsed: 0.196 s
09-Dec-2019 00:05:41 testString3(org.eclipse.jdt.core.groovy.tests.search.InferencingTests)  Time elapsed: 0.198 s
09-Dec-2019 00:05:41 testSuperFieldReference1(org.eclipse.jdt.core.groovy.tests.search.InferencingTests)  Time elapsed: 1.04 s
09-Dec-2019 00:05:41 testSuperFieldReference2(org.eclipse.jdt.core.groovy.tests.search.InferencingTests)  Time elapsed: 0.23 s
09-Dec-2019 00:05:41 testSuperFieldReference3(org.eclipse.jdt.core.groovy.tests.search.InferencingTests)  Time elapsed: 0.211 s
09-Dec-2019 00:05:41 testSuperFieldReference4(org.eclipse.jdt.core.groovy.tests.search.InferencingTests)  Time elapsed: 1.561 s
09-Dec-2019 00:05:41 testSuperFieldReference5(org.eclipse.jdt.core.groovy.tests.search.InferencingTests)  Time elapsed: 0.208 s
09-Dec-2019 00:05:41 testClassReference1(org.eclipse.jdt.core.groovy.tests.search.InferencingTests)  Time elapsed: 0.228 s
09-Dec-2019 00:05:41 testClassReference2(org.eclipse.jdt.core.groovy.tests.search.InferencingTests)  Time elapsed: 1.081 s
09-Dec-2019 00:05:41 testClassReference3(org.eclipse.jdt.core.groovy.tests.search.InferencingTests)  Time elapsed: 0.278 s
09-Dec-2019 00:05:41 testClassReference4(org.eclipse.jdt.core.groovy.tests.search.InferencingTests)  Time elapsed: 0.237 s
09-Dec-2019 00:05:41 testPropertyNodeFromJava1(org.eclipse.jdt.core.groovy.tests.search.JDTPropertyNodeInferencingTests)  Time elapsed: 0.209 s
09-Dec-2019 00:05:41 testPropertyNodeFromJava2(org.eclipse.jdt.core.groovy.tests.search.JDTPropertyNodeInferencingTests)  Time elapsed: 1.436 s
09-Dec-2019 00:05:41 testPropertyNodeFromJava3(org.eclipse.jdt.core.groovy.tests.search.JDTPropertyNodeInferencingTests)  Time elapsed: 0.215 s
09-Dec-2019 00:05:41 testPropertyNodeFromJava4(org.eclipse.jdt.core.groovy.tests.search.JDTPropertyNodeInferencingTests)  Time elapsed: 0.211 s
09-Dec-2019 00:05:41 testNodeFromJava1(org.eclipse.jdt.core.groovy.tests.search.JDTPropertyNodeInferencingTests)  Time elapsed: 1.194 s
09-Dec-2019 00:05:41 testPropertyNodeReferenceInBinary1(org.eclipse.jdt.core.groovy.tests.search.JDTPropertyNodeInferencingTests)  Time elapsed: 0.241 s
09-Dec-2019 00:05:41 testVarReferenceInGString1(org.eclipse.jdt.core.groovy.tests.search.LocalVariableReferenceSearchTests)  Time elapsed: 0.204 s
09-Dec-2019 00:05:41 testVarReferenceInGString2(org.eclipse.jdt.core.groovy.tests.search.LocalVariableReferenceSearchTests)  Time elapsed: 1.266 s
09-Dec-2019 00:05:41 testVarReferenceInGString3(org.eclipse.jdt.core.groovy.tests.search.LocalVariableReferenceSearchTests)  Time elapsed: 0.191 s
09-Dec-2019 00:05:41 testVarReferenceInGString4(org.eclipse.jdt.core.groovy.tests.search.LocalVariableReferenceSearchTests)  Time elapsed: 0.199 s
09-Dec-2019 00:05:41 testVarReferenceInGString5(org.eclipse.jdt.core.groovy.tests.search.LocalVariableReferenceSearchTests)  Time elapsed: 0.21 s
09-Dec-2019 00:05:41 testVarReference10(org.eclipse.jdt.core.groovy.tests.search.LocalVariableReferenceSearchTests)  Time elapsed: 1.396 s
09-Dec-2019 00:05:41 testVarReference1(org.eclipse.jdt.core.groovy.tests.search.LocalVariableReferenceSearchTests)  Time elapsed: 0.209 s
09-Dec-2019 00:05:41 testVarReference2(org.eclipse.jdt.core.groovy.tests.search.LocalVariableReferenceSearchTests)  Time elapsed: 0.186 s
09-Dec-2019 00:05:41 testVarReference3(org.eclipse.jdt.core.groovy.tests.search.LocalVariableReferenceSearchTests)  Time elapsed: 1.105 s
09-Dec-2019 00:05:41 testVarReference4(org.eclipse.jdt.core.groovy.tests.search.LocalVariableReferenceSearchTests)  Time elapsed: 0.178 s
09-Dec-2019 00:05:41 testVarReference5(org.eclipse.jdt.core.groovy.tests.search.LocalVariableReferenceSearchTests)  Time elapsed: 0.195 s
09-Dec-2019 00:05:41 testVarReference6(org.eclipse.jdt.core.groovy.tests.search.LocalVariableReferenceSearchTests)  Time elapsed: 1.257 s
09-Dec-2019 00:05:41 testVarReference7(org.eclipse.jdt.core.groovy.tests.search.LocalVariableReferenceSearchTests)  Time elapsed: 0.213 s
09-Dec-2019 00:05:41 testVarReference8(org.eclipse.jdt.core.groovy.tests.search.LocalVariableReferenceSearchTests)  Time elapsed: 0.193 s
09-Dec-2019 00:05:41 testVarReference9(org.eclipse.jdt.core.groovy.tests.search.LocalVariableReferenceSearchTests)  Time elapsed: 1.044 s
09-Dec-2019 00:05:41 testExplicitPropertySetterSearch1(org.eclipse.jdt.core.groovy.tests.search.MethodReferenceSearchTests)  Time elapsed: 0.677 s
09-Dec-2019 00:05:41 testExplicitPropertySetterSearch2(org.eclipse.jdt.core.groovy.tests.search.MethodReferenceSearchTests)  Time elapsed: 0.747 s
09-Dec-2019 00:05:41 testOverloadedMethodReferences1(org.eclipse.jdt.core.groovy.tests.search.MethodReferenceSearchTests)  Time elapsed: 1.575 s
09-Dec-2019 00:05:41 testOverloadedMethodReferences2(org.eclipse.jdt.core.groovy.tests.search.MethodReferenceSearchTests)  Time elapsed: 0.273 s
09-Dec-2019 00:05:41 testOverloadedMethodReferences3(org.eclipse.jdt.core.groovy.tests.search.MethodReferenceSearchTests)  Time elapsed: 0.245 s
09-Dec-2019 00:05:41 testOverloadedMethodReferences4(org.eclipse.jdt.core.groovy.tests.search.MethodReferenceSearchTests)  Time elapsed: 1.231 s
09-Dec-2019 00:05:41 testOverloadedMethodReferences5(org.eclipse.jdt.core.groovy.tests.search.MethodReferenceSearchTests)  Time elapsed: 0.271 s
09-Dec-2019 00:05:41 testStaticMethodReferenceSearch(org.eclipse.jdt.core.groovy.tests.search.MethodReferenceSearchTests)  Time elapsed: 0.979 s
09-Dec-2019 00:05:41 testMethodReferencesInClass1(org.eclipse.jdt.core.groovy.tests.search.MethodReferenceSearchTests)  Time elapsed: 0.259 s
09-Dec-2019 00:05:41 testMethodReferencesInClass2(org.eclipse.jdt.core.groovy.tests.search.MethodReferenceSearchTests)  Time elapsed: 0.232 s
09-Dec-2019 00:05:41 testMethodReferencesInClass3(org.eclipse.jdt.core.groovy.tests.search.MethodReferenceSearchTests)  Time elapsed: 1.146 s
09-Dec-2019 00:05:41 testGenericsMethodReferenceSearch(org.eclipse.jdt.core.groovy.tests.search.MethodReferenceSearchTests)  Time elapsed: 0.558 s
09-Dec-2019 00:05:41 testMethodReferencesInScript1(org.eclipse.jdt.core.groovy.tests.search.MethodReferenceSearchTests)  Time elapsed: 0.247 s
09-Dec-2019 00:05:41 testMethodReferencesInScript2(org.eclipse.jdt.core.groovy.tests.search.MethodReferenceSearchTests)  Time elapsed: 1.03 s
09-Dec-2019 00:05:41 testMethodReferencesInScript3(org.eclipse.jdt.core.groovy.tests.search.MethodReferenceSearchTests)  Time elapsed: 0.242 s
09-Dec-2019 00:05:41 testMethodReferencesInScript4(org.eclipse.jdt.core.groovy.tests.search.MethodReferenceSearchTests)  Time elapsed: 1.078 s
09-Dec-2019 00:05:41 testMethodReferencesInScript5(org.eclipse.jdt.core.groovy.tests.search.MethodReferenceSearchTests)  Time elapsed: 0.241 s
09-Dec-2019 00:05:41 testMethodReferencesInScript6(org.eclipse.jdt.core.groovy.tests.search.MethodReferenceSearchTests)  Time elapsed: 0.279 s
09-Dec-2019 00:05:41 testMethodReferencesInScript7(org.eclipse.jdt.core.groovy.tests.search.MethodReferenceSearchTests)  Time elapsed: 1.135 s
09-Dec-2019 00:05:41 testMethodReferencesInScript8(org.eclipse.jdt.core.groovy.tests.search.MethodReferenceSearchTests)  Time elapsed: 0.246 s
09-Dec-2019 00:05:41 testMethodReferencesInScript9(org.eclipse.jdt.core.groovy.tests.search.MethodReferenceSearchTests)  Time elapsed: 1.035 s
09-Dec-2019 00:05:41 testOverloadedMethodReferences5a(org.eclipse.jdt.core.groovy.tests.search.MethodReferenceSearchTests) skipped
09-Dec-2019 00:05:41 testOverloadedMethodReferences5b(org.eclipse.jdt.core.groovy.tests.search.MethodReferenceSearchTests)  Time elapsed: 0.262 s
09-Dec-2019 00:05:41 testMethodWithDefaultParameters1(org.eclipse.jdt.core.groovy.tests.search.MethodReferenceSearchTests)  Time elapsed: 1.19 s
09-Dec-2019 00:05:41 testMethodWithDefaultParameters2(org.eclipse.jdt.core.groovy.tests.search.MethodReferenceSearchTests)  Time elapsed: 0.234 s
09-Dec-2019 00:05:41 testMethodWithDefaultParameters3(org.eclipse.jdt.core.groovy.tests.search.MethodReferenceSearchTests)  Time elapsed: 0.681 s
09-Dec-2019 00:05:41 testMethodWithDefaultParameters4(org.eclipse.jdt.core.groovy.tests.search.MethodReferenceSearchTests) skipped
09-Dec-2019 00:05:41 testExplicitPropertyGetterSearch1(org.eclipse.jdt.core.groovy.tests.search.MethodReferenceSearchTests)  Time elapsed: 1.097 s
09-Dec-2019 00:05:41 testExplicitPropertyGetterSearch2(org.eclipse.jdt.core.groovy.tests.search.MethodReferenceSearchTests)  Time elapsed: 0.689 s
09-Dec-2019 00:05:41 testExplicitPropertyGetterSearch3(org.eclipse.jdt.core.groovy.tests.search.MethodReferenceSearchTests)  Time elapsed: 0.7 s
09-Dec-2019 00:05:41 testRightShift(org.eclipse.jdt.core.groovy.tests.search.OperatorOverloadingInferencingTests)  Time elapsed: 1.397 s
09-Dec-2019 00:05:41 testLeftShift(org.eclipse.jdt.core.groovy.tests.search.OperatorOverloadingInferencingTests)  Time elapsed: 0.22 s
09-Dec-2019 00:05:41 testAnd(org.eclipse.jdt.core.groovy.tests.search.OperatorOverloadingInferencingTests)  Time elapsed: 0.198 s
09-Dec-2019 00:05:41 testMod(org.eclipse.jdt.core.groovy.tests.search.OperatorOverloadingInferencingTests)  Time elapsed: 0.27 s
09-Dec-2019 00:05:41 testXor(org.eclipse.jdt.core.groovy.tests.search.OperatorOverloadingInferencingTests)  Time elapsed: 0.887 s
09-Dec-2019 00:05:41 testPlus1(org.eclipse.jdt.core.groovy.tests.search.OperatorOverloadingInferencingTests)  Time elapsed: 0.199 s
09-Dec-2019 00:05:41 testPlus2(org.eclipse.jdt.core.groovy.tests.search.OperatorOverloadingInferencingTests)  Time elapsed: 0.182 s
09-Dec-2019 00:05:41 testPlus3(org.eclipse.jdt.core.groovy.tests.search.OperatorOverloadingInferencingTests)  Time elapsed: 0.877 s
09-Dec-2019 00:05:41 testNumberPlusGString(org.eclipse.jdt.core.groovy.tests.search.OperatorOverloadingInferencingTests)  Time elapsed: 0.193 s
09-Dec-2019 00:05:41 testOr(org.eclipse.jdt.core.groovy.tests.search.OperatorOverloadingInferencingTests)  Time elapsed: 0.209 s
09-Dec-2019 00:05:41 testPrefix1(org.eclipse.jdt.core.groovy.tests.search.OperatorOverloadingInferencingTests)  Time elapsed: 0.205 s
09-Dec-2019 00:05:41 testPrefix2(org.eclipse.jdt.core.groovy.tests.search.OperatorOverloadingInferencingTests)  Time elapsed: 1.094 s
09-Dec-2019 00:05:41 testPrefix3(org.eclipse.jdt.core.groovy.tests.search.OperatorOverloadingInferencingTests)  Time elapsed: 0.179 s
09-Dec-2019 00:05:41 testPrefix4(org.eclipse.jdt.core.groovy.tests.search.OperatorOverloadingInferencingTests)  Time elapsed: 0.21 s
09-Dec-2019 00:05:41 testPrefix5(org.eclipse.jdt.core.groovy.tests.search.OperatorOverloadingInferencingTests)  Time elapsed: 1.099 s
09-Dec-2019 00:05:41 testPrefix6(org.eclipse.jdt.core.groovy.tests.search.OperatorOverloadingInferencingTests)  Time elapsed: 0.219 s
09-Dec-2019 00:05:41 testLongExpr1(org.eclipse.jdt.core.groovy.tests.search.OperatorOverloadingInferencingTests)  Time elapsed: 0.194 s
09-Dec-2019 00:05:41 testLongExpr2(org.eclipse.jdt.core.groovy.tests.search.OperatorOverloadingInferencingTests)  Time elapsed: 0.972 s
09-Dec-2019 00:05:41 testLongExpr3(org.eclipse.jdt.core.groovy.tests.search.OperatorOverloadingInferencingTests)  Time elapsed: 0.233 s
09-Dec-2019 00:05:41 testAttributeExpr1(org.eclipse.jdt.core.groovy.tests.search.OperatorOverloadingInferencingTests)  Time elapsed: 0.215 s
09-Dec-2019 00:05:41 testAttributeExpr2(org.eclipse.jdt.core.groovy.tests.search.OperatorOverloadingInferencingTests)  Time elapsed: 1.363 s
09-Dec-2019 00:05:41 testNumberPlusString(org.eclipse.jdt.core.groovy.tests.search.OperatorOverloadingInferencingTests)  Time elapsed: 0.199 s
09-Dec-2019 00:05:41 testDivide(org.eclipse.jdt.core.groovy.tests.search.OperatorOverloadingInferencingTests)  Time elapsed: 0.185 s
09-Dec-2019 00:05:41 testMultiply(org.eclipse.jdt.core.groovy.tests.search.OperatorOverloadingInferencingTests)  Time elapsed: 1.023 s
09-Dec-2019 00:05:41 testGetAt1(org.eclipse.jdt.core.groovy.tests.search.OperatorOverloadingInferencingTests)  Time elapsed: 0.194 s
09-Dec-2019 00:05:41 testGetAt2(org.eclipse.jdt.core.groovy.tests.search.OperatorOverloadingInferencingTests)  Time elapsed: 0.181 s
09-Dec-2019 00:05:41 testGetAt3(org.eclipse.jdt.core.groovy.tests.search.OperatorOverloadingInferencingTests)  Time elapsed: 1.106 s
09-Dec-2019 00:05:41 testGetAt4(org.eclipse.jdt.core.groovy.tests.search.OperatorOverloadingInferencingTests)  Time elapsed: 0.227 s
09-Dec-2019 00:05:41 testGetAt5(org.eclipse.jdt.core.groovy.tests.search.OperatorOverloadingInferencingTests)  Time elapsed: 0.212 s
09-Dec-2019 00:05:41 testGetAt6(org.eclipse.jdt.core.groovy.tests.search.OperatorOverloadingInferencingTests)  Time elapsed: 1.013 s
09-Dec-2019 00:05:41 testGetAt7(org.eclipse.jdt.core.groovy.tests.search.OperatorOverloadingInferencingTests)  Time elapsed: 0.245 s
09-Dec-2019 00:05:41 testGetAt8(org.eclipse.jdt.core.groovy.tests.search.OperatorOverloadingInferencingTests)  Time elapsed: 0.225 s
09-Dec-2019 00:05:41 testGetAt9(org.eclipse.jdt.core.groovy.tests.search.OperatorOverloadingInferencingTests)  Time elapsed: 1.055 s
09-Dec-2019 00:05:41 testPostfix1(org.eclipse.jdt.core.groovy.tests.search.OperatorOverloadingInferencingTests)  Time elapsed: 0.228 s
09-Dec-2019 00:05:41 testPostfix2(org.eclipse.jdt.core.groovy.tests.search.OperatorOverloadingInferencingTests)  Time elapsed: 0.233 s
09-Dec-2019 00:05:41 testMinus1(org.eclipse.jdt.core.groovy.tests.search.OperatorOverloadingInferencingTests)  Time elapsed: 0.227 s
09-Dec-2019 00:05:41 testMinus2(org.eclipse.jdt.core.groovy.tests.search.OperatorOverloadingInferencingTests)  Time elapsed: 1.274 s
09-Dec-2019 00:05:41 testCompleteExpr1(org.eclipse.jdt.core.groovy.tests.search.OperatorOverloadingInferencingTests)  Time elapsed: 0.22 s
09-Dec-2019 00:05:41 testCompleteExpr2(org.eclipse.jdt.core.groovy.tests.search.OperatorOverloadingInferencingTests)  Time elapsed: 0.183 s
09-Dec-2019 00:05:41 testCompleteExpr3(org.eclipse.jdt.core.groovy.tests.search.OperatorOverloadingInferencingTests)  Time elapsed: 1.159 s
09-Dec-2019 00:05:41 testCompleteExpr4(org.eclipse.jdt.core.groovy.tests.search.OperatorOverloadingInferencingTests)  Time elapsed: 0.235 s
09-Dec-2019 00:05:41 testCompleteExpr5(org.eclipse.jdt.core.groovy.tests.search.OperatorOverloadingInferencingTests)  Time elapsed: 0.275 s
09-Dec-2019 00:05:41 testCompleteExpr6(org.eclipse.jdt.core.groovy.tests.search.OperatorOverloadingInferencingTests)  Time elapsed: 1.001 s
09-Dec-2019 00:05:41 testCompleteExpr7(org.eclipse.jdt.core.groovy.tests.search.OperatorOverloadingInferencingTests)  Time elapsed: 0.2 s
09-Dec-2019 00:05:41 testCompleteExpr8(org.eclipse.jdt.core.groovy.tests.search.OperatorOverloadingInferencingTests)  Time elapsed: 0.196 s
09-Dec-2019 00:05:41 testEqualsCheck(org.eclipse.jdt.core.groovy.tests.search.SpockInferencingTests) skipped
09-Dec-2019 00:05:41 testDataTableChecks(org.eclipse.jdt.core.groovy.tests.search.SpockInferencingTests) skipped
09-Dec-2019 00:05:41 testGetterCheck(org.eclipse.jdt.core.groovy.tests.search.SpockInferencingTests) skipped
09-Dec-2019 00:05:41 testPropertyCheck(org.eclipse.jdt.core.groovy.tests.search.SpockInferencingTests) skipped
09-Dec-2019 00:05:41 testBasics(org.eclipse.jdt.core.groovy.tests.search.SpockInferencingTests) skipped
09-Dec-2019 00:05:41 testNonStaticReference1(org.eclipse.jdt.core.groovy.tests.search.StaticInferencingTests)  Time elapsed: 0.206 s
09-Dec-2019 00:05:41 testNonStaticReference2(org.eclipse.jdt.core.groovy.tests.search.StaticInferencingTests)  Time elapsed: 0.22 s
09-Dec-2019 00:05:41 testNonStaticReference3(org.eclipse.jdt.core.groovy.tests.search.StaticInferencingTests)  Time elapsed: 1.448 s
09-Dec-2019 00:05:41 testNonStaticReference4(org.eclipse.jdt.core.groovy.tests.search.StaticInferencingTests)  Time elapsed: 0.259 s
09-Dec-2019 00:05:41 testNonStaticReference5(org.eclipse.jdt.core.groovy.tests.search.StaticInferencingTests)  Time elapsed: 0.208 s
09-Dec-2019 00:05:41 testNonStaticReference6(org.eclipse.jdt.core.groovy.tests.search.StaticInferencingTests)  Time elapsed: 0.976 s
09-Dec-2019 00:05:41 testNonStaticReference7(org.eclipse.jdt.core.groovy.tests.search.StaticInferencingTests)  Time elapsed: 0.212 s
09-Dec-2019 00:05:41 testNonStaticReference8(org.eclipse.jdt.core.groovy.tests.search.StaticInferencingTests)  Time elapsed: 0.181 s
09-Dec-2019 00:05:41 testStaticReference1(org.eclipse.jdt.core.groovy.tests.search.StaticInferencingTests)  Time elapsed: 1.218 s
09-Dec-2019 00:05:41 testStaticReference2(org.eclipse.jdt.core.groovy.tests.search.StaticInferencingTests)  Time elapsed: 0.149 s
09-Dec-2019 00:05:41 testStaticReference3(org.eclipse.jdt.core.groovy.tests.search.StaticInferencingTests)  Time elapsed: 0.189 s
09-Dec-2019 00:05:41 testStaticReference4(org.eclipse.jdt.core.groovy.tests.search.StaticInferencingTests)  Time elapsed: 0.226 s
09-Dec-2019 00:05:41 testStaticReference5(org.eclipse.jdt.core.groovy.tests.search.StaticInferencingTests)  Time elapsed: 1.339 s
09-Dec-2019 00:05:41 testStaticReference6(org.eclipse.jdt.core.groovy.tests.search.StaticInferencingTests)  Time elapsed: 0.182 s
09-Dec-2019 00:05:41 testStaticReference7(org.eclipse.jdt.core.groovy.tests.search.StaticInferencingTests)  Time elapsed: 0.205 s
09-Dec-2019 00:05:41 testStaticReference8(org.eclipse.jdt.core.groovy.tests.search.StaticInferencingTests)  Time elapsed: 1.175 s
09-Dec-2019 00:05:41 testStaticReference9(org.eclipse.jdt.core.groovy.tests.search.StaticInferencingTests)  Time elapsed: 0.177 s
09-Dec-2019 00:05:41 testStaticImport1(org.eclipse.jdt.core.groovy.tests.search.StaticInferencingTests)  Time elapsed: 0.203 s
09-Dec-2019 00:05:41 testStaticImport2(org.eclipse.jdt.core.groovy.tests.search.StaticInferencingTests)  Time elapsed: 0.194 s
09-Dec-2019 00:05:41 testStaticImport3(org.eclipse.jdt.core.groovy.tests.search.StaticInferencingTests)  Time elapsed: 1.068 s
09-Dec-2019 00:05:41 testStaticImport4(org.eclipse.jdt.core.groovy.tests.search.StaticInferencingTests)  Time elapsed: 0.232 s
09-Dec-2019 00:05:41 testStaticImport5(org.eclipse.jdt.core.groovy.tests.search.StaticInferencingTests)  Time elapsed: 0.231 s
09-Dec-2019 00:05:41 testStaticImport6(org.eclipse.jdt.core.groovy.tests.search.StaticInferencingTests)  Time elapsed: 1.243 s
09-Dec-2019 00:05:41 testStaticImport7(org.eclipse.jdt.core.groovy.tests.search.StaticInferencingTests)  Time elapsed: 0.209 s
09-Dec-2019 00:05:41 testStaticImport8(org.eclipse.jdt.core.groovy.tests.search.StaticInferencingTests)  Time elapsed: 0.197 s
09-Dec-2019 00:05:41 testStaticImport9(org.eclipse.jdt.core.groovy.tests.search.StaticInferencingTests)  Time elapsed: 1.119 s
09-Dec-2019 00:05:41 testStaticImport10(org.eclipse.jdt.core.groovy.tests.search.StaticInferencingTests)  Time elapsed: 0.21 s
09-Dec-2019 00:05:41 testStaticImport11(org.eclipse.jdt.core.groovy.tests.search.StaticInferencingTests)  Time elapsed: 0.2 s
09-Dec-2019 00:05:41 testStaticImport12(org.eclipse.jdt.core.groovy.tests.search.StaticInferencingTests)  Time elapsed: 1.162 s
09-Dec-2019 00:05:41 testStaticImport13(org.eclipse.jdt.core.groovy.tests.search.StaticInferencingTests) skipped
09-Dec-2019 00:05:41 testStaticImport14(org.eclipse.jdt.core.groovy.tests.search.StaticInferencingTests) skipped
09-Dec-2019 00:05:41 testStaticImport15(org.eclipse.jdt.core.groovy.tests.search.StaticInferencingTests) skipped
09-Dec-2019 00:05:41 testClassReference16a(org.eclipse.jdt.core.groovy.tests.search.StaticInferencingTests)  Time elapsed: 0.191 s
09-Dec-2019 00:05:41 testClassReference17a(org.eclipse.jdt.core.groovy.tests.search.StaticInferencingTests)  Time elapsed: 0.205 s
09-Dec-2019 00:05:41 testStaticReference10a(org.eclipse.jdt.core.groovy.tests.search.StaticInferencingTests)  Time elapsed: 1.187 s
09-Dec-2019 00:05:41 testClassReference10(org.eclipse.jdt.core.groovy.tests.search.StaticInferencingTests)  Time elapsed: 0.177 s
09-Dec-2019 00:05:41 testClassReference11(org.eclipse.jdt.core.groovy.tests.search.StaticInferencingTests)  Time elapsed: 0.212 s
09-Dec-2019 00:05:41 testClassReference12(org.eclipse.jdt.core.groovy.tests.search.StaticInferencingTests)  Time elapsed: 0.996 s
09-Dec-2019 00:05:41 testClassReference13(org.eclipse.jdt.core.groovy.tests.search.StaticInferencingTests)  Time elapsed: 0.219 s
09-Dec-2019 00:05:41 testClassReference14(org.eclipse.jdt.core.groovy.tests.search.StaticInferencingTests)  Time elapsed: 0.192 s
09-Dec-2019 00:05:41 testClassReference15(org.eclipse.jdt.core.groovy.tests.search.StaticInferencingTests)  Time elapsed: 0.191 s
09-Dec-2019 00:05:41 testClassReference16(org.eclipse.jdt.core.groovy.tests.search.StaticInferencingTests)  Time elapsed: 1.207 s
09-Dec-2019 00:05:41 testClassReference17(org.eclipse.jdt.core.groovy.tests.search.StaticInferencingTests)  Time elapsed: 0.246 s
09-Dec-2019 00:05:41 testClassReference4a(org.eclipse.jdt.core.groovy.tests.search.StaticInferencingTests)  Time elapsed: 0.176 s
09-Dec-2019 00:05:41 testStaticReference10(org.eclipse.jdt.core.groovy.tests.search.StaticInferencingTests)  Time elapsed: 0.229 s
09-Dec-2019 00:05:41 testStaticReference1a(org.eclipse.jdt.core.groovy.tests.search.StaticInferencingTests)  Time elapsed: 0.843 s
09-Dec-2019 00:05:41 testStaticReference1b(org.eclipse.jdt.core.groovy.tests.search.StaticInferencingTests)  Time elapsed: 0.181 s
09-Dec-2019 00:05:41 testStaticReference9a(org.eclipse.jdt.core.groovy.tests.search.StaticInferencingTests)  Time elapsed: 0.192 s
09-Dec-2019 00:05:41 testClassReference1(org.eclipse.jdt.core.groovy.tests.search.StaticInferencingTests)  Time elapsed: 0.944 s
09-Dec-2019 00:05:41 testClassReference2(org.eclipse.jdt.core.groovy.tests.search.StaticInferencingTests)  Time elapsed: 0.176 s
09-Dec-2019 00:05:41 testClassReference3(org.eclipse.jdt.core.groovy.tests.search.StaticInferencingTests)  Time elapsed: 0.194 s
09-Dec-2019 00:05:41 testClassReference4(org.eclipse.jdt.core.groovy.tests.search.StaticInferencingTests)  Time elapsed: 0.902 s
09-Dec-2019 00:05:41 testClassReference5(org.eclipse.jdt.core.groovy.tests.search.StaticInferencingTests)  Time elapsed: 0.207 s
09-Dec-2019 00:05:41 testClassReference6(org.eclipse.jdt.core.groovy.tests.search.StaticInferencingTests)  Time elapsed: 0.196 s
09-Dec-2019 00:05:41 testClassReference7(org.eclipse.jdt.core.groovy.tests.search.StaticInferencingTests)  Time elapsed: 0.175 s
09-Dec-2019 00:05:41 testClassReference8(org.eclipse.jdt.core.groovy.tests.search.StaticInferencingTests)  Time elapsed: 1.013 s
09-Dec-2019 00:05:41 testClassReference9(org.eclipse.jdt.core.groovy.tests.search.StaticInferencingTests)  Time elapsed: 0.203 s
09-Dec-2019 00:05:41 testSyntheticAccessors1(org.eclipse.jdt.core.groovy.tests.search.SyntheticAccessorInferencingTests)  Time elapsed: 0.29 s
09-Dec-2019 00:05:41 testSyntheticAccessors2(org.eclipse.jdt.core.groovy.tests.search.SyntheticAccessorInferencingTests)  Time elapsed: 1.677 s
09-Dec-2019 00:05:41 testSyntheticAccessors3(org.eclipse.jdt.core.groovy.tests.search.SyntheticAccessorInferencingTests)  Time elapsed: 0.276 s
09-Dec-2019 00:05:41 testSyntheticAccessors4(org.eclipse.jdt.core.groovy.tests.search.SyntheticAccessorInferencingTests)  Time elapsed: 4.516 s
09-Dec-2019 00:05:41 testPublicStaticSuperMethod1(org.eclipse.jdt.core.groovy.tests.search.TraitInferencingTests)  Time elapsed: 0.288 s
09-Dec-2019 00:05:41 testPublicStaticSuperMethod2(org.eclipse.jdt.core.groovy.tests.search.TraitInferencingTests)  Time elapsed: 1.398 s
09-Dec-2019 00:05:41 testProperty10(org.eclipse.jdt.core.groovy.tests.search.TraitInferencingTests)  Time elapsed: 0.28 s
09-Dec-2019 00:05:41 testProperty11(org.eclipse.jdt.core.groovy.tests.search.TraitInferencingTests)  Time elapsed: 0.259 s
09-Dec-2019 00:05:41 testProperty12(org.eclipse.jdt.core.groovy.tests.search.TraitInferencingTests)  Time elapsed: 1.079 s
09-Dec-2019 00:05:41 testProperty13(org.eclipse.jdt.core.groovy.tests.search.TraitInferencingTests)  Time elapsed: 0.204 s
09-Dec-2019 00:05:41 testProperty14(org.eclipse.jdt.core.groovy.tests.search.TraitInferencingTests)  Time elapsed: 0.238 s
09-Dec-2019 00:05:41 testPrivateStaticField(org.eclipse.jdt.core.groovy.tests.search.TraitInferencingTests)  Time elapsed: 0.953 s
09-Dec-2019 00:05:41 testPrivateMethod1(org.eclipse.jdt.core.groovy.tests.search.TraitInferencingTests)  Time elapsed: 0.217 s
09-Dec-2019 00:05:41 testPrivateMethod2(org.eclipse.jdt.core.groovy.tests.search.TraitInferencingTests)  Time elapsed: 0.256 s
09-Dec-2019 00:05:41 testPrivateMethod3(org.eclipse.jdt.core.groovy.tests.search.TraitInferencingTests)  Time elapsed: 1.181 s
09-Dec-2019 00:05:41 testPrivateMethod4(org.eclipse.jdt.core.groovy.tests.search.TraitInferencingTests)  Time elapsed: 0.241 s
09-Dec-2019 00:05:41 testPublicStaticField(org.eclipse.jdt.core.groovy.tests.search.TraitInferencingTests)  Time elapsed: 0.262 s
09-Dec-2019 00:05:41 testPublicMethod1(org.eclipse.jdt.core.groovy.tests.search.TraitInferencingTests)  Time elapsed: 1.044 s
09-Dec-2019 00:05:41 testPublicMethod2(org.eclipse.jdt.core.groovy.tests.search.TraitInferencingTests)  Time elapsed: 0.27 s
09-Dec-2019 00:05:41 testPublicMethod3(org.eclipse.jdt.core.groovy.tests.search.TraitInferencingTests)  Time elapsed: 1.108 s
09-Dec-2019 00:05:41 testPublicMethod4(org.eclipse.jdt.core.groovy.tests.search.TraitInferencingTests)  Time elapsed: 0.294 s
09-Dec-2019 00:05:41 testPrivateStaticMethod(org.eclipse.jdt.core.groovy.tests.search.TraitInferencingTests)  Time elapsed: 0.276 s
09-Dec-2019 00:05:41 testProperty1(org.eclipse.jdt.core.groovy.tests.search.TraitInferencingTests)  Time elapsed: 1.215 s
09-Dec-2019 00:05:41 testProperty2(org.eclipse.jdt.core.groovy.tests.search.TraitInferencingTests)  Time elapsed: 0.348 s
09-Dec-2019 00:05:41 testProperty3(org.eclipse.jdt.core.groovy.tests.search.TraitInferencingTests)  Time elapsed: 1.135 s
09-Dec-2019 00:05:41 testProperty4(org.eclipse.jdt.core.groovy.tests.search.TraitInferencingTests)  Time elapsed: 0.257 s
09-Dec-2019 00:05:41 testProperty5(org.eclipse.jdt.core.groovy.tests.search.TraitInferencingTests)  Time elapsed: 0.239 s
09-Dec-2019 00:05:41 testProperty6(org.eclipse.jdt.core.groovy.tests.search.TraitInferencingTests)  Time elapsed: 0.24 s
09-Dec-2019 00:05:41 testProperty7(org.eclipse.jdt.core.groovy.tests.search.TraitInferencingTests)  Time elapsed: 3.008 s
09-Dec-2019 00:05:41 testProperty8(org.eclipse.jdt.core.groovy.tests.search.TraitInferencingTests)  Time elapsed: 0.297 s
09-Dec-2019 00:05:41 testProperty9(org.eclipse.jdt.core.groovy.tests.search.TraitInferencingTests)  Time elapsed: 0.238 s
09-Dec-2019 00:05:41 testPublicStaticFinalField(org.eclipse.jdt.core.groovy.tests.search.TraitInferencingTests)  Time elapsed: 0.906 s
09-Dec-2019 00:05:41 testPublicField1(org.eclipse.jdt.core.groovy.tests.search.TraitInferencingTests)  Time elapsed: 0.224 s
09-Dec-2019 00:05:41 testPublicField2(org.eclipse.jdt.core.groovy.tests.search.TraitInferencingTests)  Time elapsed: 0.265 s
09-Dec-2019 00:05:41 testPrivateStaticFinalField(org.eclipse.jdt.core.groovy.tests.search.TraitInferencingTests)  Time elapsed: 1.029 s
09-Dec-2019 00:05:41 testPrivateField1(org.eclipse.jdt.core.groovy.tests.search.TraitInferencingTests)  Time elapsed: 0.244 s
09-Dec-2019 00:05:41 testPrivateField2(org.eclipse.jdt.core.groovy.tests.search.TraitInferencingTests)  Time elapsed: 1.07 s
09-Dec-2019 00:05:41 testFindClassDeclarationWithPattern(org.eclipse.jdt.core.groovy.tests.search.TypeReferenceSearchTests)  Time elapsed: 0.274 s  <<< FAILURE!
09-Dec-2019 00:05:41 java.lang.AssertionError:
09-Dec-2019 00:05:41 Expected but not found: SongTests (not open) [in SongTests.groovy [in gtunes [in src [in Project]]]]
09-Dec-2019 00:05:41 Expected but not found: ArtistTests (not open) [in ArtistTests.groovy [in gtunes [in src [in Project]]]]
09-Dec-2019 00:05:41 Found but not expected: class ArtistTests [in ArtistTests.groovy [in src.gtunes [in <project root> [in Project]]]]
09-Dec-2019 00:05:41   java.lang.Object testSomething()
09-Dec-2019 00:05:41 Found but not expected: class SongTests [in SongTests.groovy [in src.gtunes [in <project root> [in Project]]]]
09-Dec-2019 00:05:41   java.lang.Object testSomething()
09-Dec-2019 00:05:41
09-Dec-2019 00:05:41         at org.eclipse.jdt.core.groovy.tests.search.TypeReferenceSearchTests.assertElements(TypeReferenceSearchTests.java:458)
09-Dec-2019 00:05:41         at org.eclipse.jdt.core.groovy.tests.search.TypeReferenceSearchTests.testFindClassDeclarationWithPattern(TypeReferenceSearchTests.java:222)
09-Dec-2019 00:05:41
09-Dec-2019 00:05:41 testInnerTypes1(org.eclipse.jdt.core.groovy.tests.search.TypeReferenceSearchTests)  Time elapsed: 1.142 s
09-Dec-2019 00:05:41 testInnerTypes2(org.eclipse.jdt.core.groovy.tests.search.TypeReferenceSearchTests)  Time elapsed: 2.06 s
09-Dec-2019 00:05:41 testInnerTypes3(org.eclipse.jdt.core.groovy.tests.search.TypeReferenceSearchTests)  Time elapsed: 1.125 s
09-Dec-2019 00:05:41 testSearchForTypesScript1(org.eclipse.jdt.core.groovy.tests.search.TypeReferenceSearchTests)  Time elapsed: 0.222 s
09-Dec-2019 00:05:41 testSearchForTypesScript2(org.eclipse.jdt.core.groovy.tests.search.TypeReferenceSearchTests)  Time elapsed: 1.066 s
09-Dec-2019 00:05:41 testSearchForTypesScript3(org.eclipse.jdt.core.groovy.tests.search.TypeReferenceSearchTests)  Time elapsed: 0.225 s
09-Dec-2019 00:05:41 testSearchForTypesScript4(org.eclipse.jdt.core.groovy.tests.search.TypeReferenceSearchTests)  Time elapsed: 0.212 s
09-Dec-2019 00:05:41 testSearchForTypesScript5(org.eclipse.jdt.core.groovy.tests.search.TypeReferenceSearchTests)  Time elapsed: 0.259 s
09-Dec-2019 00:05:41 testSearchForTypesScript6(org.eclipse.jdt.core.groovy.tests.search.TypeReferenceSearchTests)  Time elapsed: 0.923 s
09-Dec-2019 00:05:41 testShouldntFindClassDeclarationInScript(org.eclipse.jdt.core.groovy.tests.search.TypeReferenceSearchTests)  Time elapsed: 0.253 s
09-Dec-2019 00:05:41 testSearchForTypesArray1(org.eclipse.jdt.core.groovy.tests.search.TypeReferenceSearchTests)  Time elapsed: 0.227 s
09-Dec-2019 00:05:41 testSearchForTypesClass1(org.eclipse.jdt.core.groovy.tests.search.TypeReferenceSearchTests)  Time elapsed: 0.866 s
09-Dec-2019 00:05:41 testSearchForTypesClass2(org.eclipse.jdt.core.groovy.tests.search.TypeReferenceSearchTests)  Time elapsed: 0.146 s
09-Dec-2019 00:05:41 testSearchForTypesClass3(org.eclipse.jdt.core.groovy.tests.search.TypeReferenceSearchTests)  Time elapsed: 0.142 s
09-Dec-2019 00:05:41 testSearchForTypesClass4(org.eclipse.jdt.core.groovy.tests.search.TypeReferenceSearchTests)  Time elapsed: 0.143 s
09-Dec-2019 00:05:41 testSearchForTypesClass5(org.eclipse.jdt.core.groovy.tests.search.TypeReferenceSearchTests)  Time elapsed: 0.916 s
09-Dec-2019 00:05:41 testSearchForTypesClass6(org.eclipse.jdt.core.groovy.tests.search.TypeReferenceSearchTests)  Time elapsed: 0.191 s
09-Dec-2019 00:05:41 testSearchForTypesClass7(org.eclipse.jdt.core.groovy.tests.search.TypeReferenceSearchTests)  Time elapsed: 0.236 s
09-Dec-2019 00:05:41 testSearchForTypesClosure1(org.eclipse.jdt.core.groovy.tests.search.TypeReferenceSearchTests)  Time elapsed: 0.209 s
09-Dec-2019 00:05:41 testSearchForTypesClosure2(org.eclipse.jdt.core.groovy.tests.search.TypeReferenceSearchTests)  Time elapsed: 1.024 s
09-Dec-2019 00:05:41 testSearchForTypesClosure3(org.eclipse.jdt.core.groovy.tests.search.TypeReferenceSearchTests)  Time elapsed: 0.225 s
09-Dec-2019 00:05:41 testCoercion1(org.eclipse.jdt.core.groovy.tests.search.TypeReferenceSearchTests)  Time elapsed: 0.152 s
09-Dec-2019 00:05:41 testGenerics1(org.eclipse.jdt.core.groovy.tests.search.TypeReferenceSearchTests)  Time elapsed: 0.138 s
09-Dec-2019 00:05:41 testFindClassDeclaration(org.eclipse.jdt.core.groovy.tests.search.TypeReferenceSearchTests)  Time elapsed: 1.016 s
09-Dec-2019 00:05:41 testConstructorWithDefaultArgsInCompileStatic(org.eclipse.jdt.core.groovy.tests.search.TypeReferenceSearchTests)  Time elapsed: 1.19 s
09-Dec-2019 00:05:41
09-Dec-2019 00:05:41 Results:
09-Dec-2019 00:05:41
09-Dec-2019 00:05:41 Failures:
09-Dec-2019 00:05:41   BasicGroovyBuildTests.testProjectBasedirAsOutputLocation:274->BuilderTestSuite.expectingCompiledClasses:215->BuilderTestSuite.expectingCompiling:231 unexpected recompiled units. lenExpected=1 lenActual=2 expected:<{p.Script[]}> but was:<{p.Script[,p.Script]}>
09-Dec-2019 00:05:41   BasicGroovyBuildTests.testUpdateProjectPreferences:3328->BuilderTestSuite.expectingNoProblems:244->BuilderTestSuite.expectingNoProblemsFor:249
09-Dec-2019 00:05:41 ----------- Expected ------------
09-Dec-2019 00:05:41
09-Dec-2019 00:05:41 ------------ but was ------------
09-Dec-2019 00:05:41 Problem : The import util.MyException is never used [ resource : </Project/src/p/Test.java> range : <18,34> category : <120> severity : <1>]
09-Dec-2019 00:05:41
09-Dec-2019 00:05:41 --------- Difference is ----------
09-Dec-2019 00:05:41 expected:<[]> but was:<[Problem : The import util.MyException is never used [ resource : </Project/src/p/Test.java> range : <18,34> category : <120> severity : <1>]
09-Dec-2019 00:05:41 ]>
09-Dec-2019 00:05:41   ConstructorReferenceSearchTests.testConstructorReferences3:126 expected:<3> but was:<0>
09-Dec-2019 00:05:41   TypeReferenceSearchTests.testFindClassDeclarationWithPattern:222->assertElements:458 Expected but not found: SongTests (not open) [in SongTests.groovy [in gtunes [in src [in Project]]]]
09-Dec-2019 00:05:41 Expected but not found: ArtistTests (not open) [in ArtistTests.groovy [in gtunes [in src [in Project]]]]
09-Dec-2019 00:05:41 Found but not expected: class ArtistTests [in ArtistTests.groovy [in src.gtunes [in <project root> [in Project]]]]
09-Dec-2019 00:05:41   java.lang.Object testSomething()
09-Dec-2019 00:05:41 Found but not expected: class SongTests [in SongTests.groovy [in src.gtunes [in <project root> [in Project]]]]
09-Dec-2019 00:05:41   java.lang.Object testSomething()
09-Dec-2019 00:05:41
09-Dec-2019 00:05:41
09-Dec-2019 00:05:41 Tests run: 6190, Failures: 4, Errors: 0, Skipped: 119
09-Dec-2019 00:05:41
09-Dec-2019 00:05:44
09-Dec-2019 00:05:44 !ENTRY org.eclipse.core.resources 2 10035 2019-12-09 00:05:44.738
09-Dec-2019 00:05:44 !MESSAGE The workspace will exit with unsaved changes in this session.
09-Dec-2019 00:05:46 [ERROR] There are test failures.
09-Dec-2019 00:05:46
09-Dec-2019 00:05:46 Please refer to /opt/bamboo-home/xml-data/build-dir/GRECLIPSE-GE49-JOB1/ide-test/org.codehaus.groovy.alltests/target/surefire-reports for the individual test results.
09-Dec-2019 00:05:46 [INFO]
09-Dec-2019 00:05:46 [INFO] --- maven-install-plugin:2.3.1:install (default-install) @ org.codehaus.groovy.alltests ---
09-Dec-2019 00:05:46 [INFO] Installing /opt/bamboo-home/xml-data/build-dir/GRECLIPSE-GE49-JOB1/ide-test/org.codehaus.groovy.alltests/target/org.codehaus.groovy.alltests-3.6.0-SNAPSHOT.jar to /home/bamboo/.m2/repository/org/codehaus/groovy/eclipse/org.codehaus.groovy.alltests/3.6.0-SNAPSHOT/org.codehaus.groovy.alltests-3.6.0-SNAPSHOT.jar
09-Dec-2019 00:05:46 [INFO] Installing /opt/bamboo-home/xml-data/build-dir/GRECLIPSE-GE49-JOB1/ide-test/org.codehaus.groovy.alltests/pom.xml to /home/bamboo/.m2/repository/org/codehaus/groovy/eclipse/org.codehaus.groovy.alltests/3.6.0-SNAPSHOT/org.codehaus.groovy.alltests-3.6.0-SNAPSHOT.pom
09-Dec-2019 00:05:46 [INFO] Installing /opt/bamboo-home/xml-data/build-dir/GRECLIPSE-GE49-JOB1/ide-test/org.codehaus.groovy.alltests/target/org.codehaus.groovy.alltests-3.6.0-SNAPSHOT-sources.jar to /home/bamboo/.m2/repository/org/codehaus/groovy/eclipse/org.codehaus.groovy.alltests/3.6.0-SNAPSHOT/org.codehaus.groovy.alltests-3.6.0-SNAPSHOT-sources.jar
09-Dec-2019 00:05:46 [INFO] Installing /opt/bamboo-home/xml-data/build-dir/GRECLIPSE-GE49-JOB1/ide-test/org.codehaus.groovy.alltests/target/p2content.xml to /home/bamboo/.m2/repository/org/codehaus/groovy/eclipse/org.codehaus.groovy.alltests/3.6.0-SNAPSHOT/org.codehaus.groovy.alltests-3.6.0-SNAPSHOT-p2metadata.xml
09-Dec-2019 00:05:46 [INFO] Installing /opt/bamboo-home/xml-data/build-dir/GRECLIPSE-GE49-JOB1/ide-test/org.codehaus.groovy.alltests/target/p2artifacts.xml to /home/bamboo/.m2/repository/org/codehaus/groovy/eclipse/org.codehaus.groovy.alltests/3.6.0-SNAPSHOT/org.codehaus.groovy.alltests-3.6.0-SNAPSHOT-p2artifacts.xml
09-Dec-2019 00:05:46 [INFO] Installing /opt/bamboo-home/xml-data/build-dir/GRECLIPSE-GE49-JOB1/ide-test/org.codehaus.groovy.alltests/target/p2content.xml to /home/bamboo/.m2/repository/org/codehaus/groovy/eclipse/org.codehaus.groovy.alltests/3.6.0-SNAPSHOT/org.codehaus.groovy.alltests-3.6.0-SNAPSHOT-p2metadata.xml
09-Dec-2019 00:05:46 [INFO] Installing /opt/bamboo-home/xml-data/build-dir/GRECLIPSE-GE49-JOB1/ide-test/org.codehaus.groovy.alltests/target/p2artifacts.xml to /home/bamboo/.m2/repository/org/codehaus/groovy/eclipse/org.codehaus.groovy.alltests/3.6.0-SNAPSHOT/org.codehaus.groovy.alltests-3.6.0-SNAPSHOT-p2artifacts.xml
09-Dec-2019 00:05:46 [INFO]
09-Dec-2019 00:05:46 [INFO] --- tycho-p2-plugin:1.5.0:update-local-index (default-update-local-index) @ org.codehaus.groovy.alltests ---
09-Dec-2019 00:05:46 [INFO]
09-Dec-2019 00:05:46 [INFO] --- maven-deploy-plugin:2.8.2:deploy (default-deploy) @ org.codehaus.groovy.alltests ---
09-Dec-2019 00:05:46 [INFO] Skipping artifact deployment
09-Dec-2019 00:05:46 [INFO]
09-Dec-2019 00:05:46 [INFO] -----< org.codehaus.groovy.eclipse:org.codehaus.groovy.m2eclipse >------
09-Dec-2019 00:05:46 [INFO] Building org.codehaus.groovy.m2eclipse 3.6.0-SNAPSHOT            [38/40]
09-Dec-2019 00:05:46 [INFO] ---------------------------[ eclipse-plugin ]---------------------------
09-Dec-2019 00:05:46 [INFO]
09-Dec-2019 00:05:46 [INFO] --- maven-clean-plugin:2.5:clean (default-clean) @ org.codehaus.groovy.m2eclipse ---
09-Dec-2019 00:05:46 [INFO]
09-Dec-2019 00:05:46 [INFO] --- tycho-packaging-plugin:1.5.0:build-qualifier (default-build-qualifier) @ org.codehaus.groovy.m2eclipse ---
09-Dec-2019 00:05:46 [INFO] The project's OSGi version is 3.6.0.v201912082230-e1809
09-Dec-2019 00:05:46 [INFO]
09-Dec-2019 00:05:46 [INFO] --- tycho-packaging-plugin:1.5.0:validate-id (default-validate-id) @ org.codehaus.groovy.m2eclipse ---
09-Dec-2019 00:05:46 [INFO]
09-Dec-2019 00:05:46 [INFO] --- tycho-packaging-plugin:1.5.0:validate-version (default-validate-version) @ org.codehaus.groovy.m2eclipse ---
09-Dec-2019 00:05:46 [INFO]
09-Dec-2019 00:05:46 [INFO] --- properties-maven-plugin:1.0.0:read-project-properties (default) @ org.codehaus.groovy.m2eclipse ---
09-Dec-2019 00:05:46 [INFO]
09-Dec-2019 00:05:46 [INFO] --- maven-resources-plugin:2.4.3:resources (default-resources) @ org.codehaus.groovy.m2eclipse ---
09-Dec-2019 00:05:46 [INFO] Using 'UTF-8' encoding to copy filtered resources.
09-Dec-2019 00:05:46 [INFO] skip non existing resourceDirectory /opt/bamboo-home/xml-data/build-dir/GRECLIPSE-GE49-JOB1/extras/org.codehaus.groovy.m2eclipse/src/main/resources
09-Dec-2019 00:05:46 [INFO]
09-Dec-2019 00:05:46 [INFO] --- tycho-compiler-plugin:1.5.0:compile (default-compile) @ org.codehaus.groovy.m2eclipse ---
09-Dec-2019 00:05:46 [INFO] Compiling 2 source files to /opt/bamboo-home/xml-data/build-dir/GRECLIPSE-GE49-JOB1/extras/org.codehaus.groovy.m2eclipse/target/classes
09-Dec-2019 00:05:46 [INFO]
09-Dec-2019 00:05:46 [INFO] --- maven-resources-plugin:2.4.3:testResources (default-testResources) @ org.codehaus.groovy.m2eclipse ---
09-Dec-2019 00:05:46 [INFO] Using 'UTF-8' encoding to copy filtered resources.
09-Dec-2019 00:05:46 [INFO] skip non existing resourceDirectory /opt/bamboo-home/xml-data/build-dir/GRECLIPSE-GE49-JOB1/extras/org.codehaus.groovy.m2eclipse/src/test/resources
09-Dec-2019 00:05:46 [INFO]
09-Dec-2019 00:05:46 [INFO] --- tycho-source-plugin:1.5.0:plugin-source (plugin-source) @ org.codehaus.groovy.m2eclipse ---
09-Dec-2019 00:05:46 [INFO] Building jar: /opt/bamboo-home/xml-data/build-dir/GRECLIPSE-GE49-JOB1/extras/org.codehaus.groovy.m2eclipse/target/org.codehaus.groovy.m2eclipse-3.6.0-SNAPSHOT-sources.jar
09-Dec-2019 00:05:46 [INFO]
09-Dec-2019 00:05:46 [INFO] --- target-platform-configuration:1.5.0:target-platform (default-target-platform) @ org.codehaus.groovy.m2eclipse ---
09-Dec-2019 00:05:46 [INFO]
09-Dec-2019 00:05:46 [INFO] --- tycho-packaging-plugin:1.5.0:package-plugin (default-package-plugin) @ org.codehaus.groovy.m2eclipse ---
09-Dec-2019 00:05:46 [INFO] Building jar: /opt/bamboo-home/xml-data/build-dir/GRECLIPSE-GE49-JOB1/extras/org.codehaus.groovy.m2eclipse/target/org.codehaus.groovy.m2eclipse-3.6.0-SNAPSHOT.jar
09-Dec-2019 00:05:46 [INFO]
09-Dec-2019 00:05:46 [INFO] --- tycho-p2-plugin:1.5.0:p2-metadata-default (default-p2-metadata-default) @ org.codehaus.groovy.m2eclipse ---
09-Dec-2019 00:05:46 [INFO]
09-Dec-2019 00:05:46 [INFO] --- maven-jarsigner-plugin:3.0.0:sign (sign) @ org.codehaus.groovy.m2eclipse ---
09-Dec-2019 00:05:47 [INFO] 2 archive(s) processed
09-Dec-2019 00:05:47 [INFO]
09-Dec-2019 00:05:47 [INFO] --- tycho-source-feature-plugin:1.5.0:source-feature (source-feature) @ org.codehaus.groovy.m2eclipse ---
09-Dec-2019 00:05:47 [INFO]
09-Dec-2019 00:05:47 [INFO] --- tycho-p2-plugin:1.5.0:p2-metadata (attach-p2-metadata) @ org.codehaus.groovy.m2eclipse ---
09-Dec-2019 00:05:47 [INFO]
09-Dec-2019 00:05:47 [INFO] --- maven-install-plugin:2.3.1:install (default-install) @ org.codehaus.groovy.m2eclipse ---
09-Dec-2019 00:05:47 [INFO] Installing /opt/bamboo-home/xml-data/build-dir/GRECLIPSE-GE49-JOB1/extras/org.codehaus.groovy.m2eclipse/target/org.codehaus.groovy.m2eclipse-3.6.0-SNAPSHOT.jar to /home/bamboo/.m2/repository/org/codehaus/groovy/eclipse/org.codehaus.groovy.m2eclipse/3.6.0-SNAPSHOT/org.codehaus.groovy.m2eclipse-3.6.0-SNAPSHOT.jar
09-Dec-2019 00:05:47 [INFO] Installing /opt/bamboo-home/xml-data/build-dir/GRECLIPSE-GE49-JOB1/extras/org.codehaus.groovy.m2eclipse/pom.xml to /home/bamboo/.m2/repository/org/codehaus/groovy/eclipse/org.codehaus.groovy.m2eclipse/3.6.0-SNAPSHOT/org.codehaus.groovy.m2eclipse-3.6.0-SNAPSHOT.pom
09-Dec-2019 00:05:47 [INFO] Installing /opt/bamboo-home/xml-data/build-dir/GRECLIPSE-GE49-JOB1/extras/org.codehaus.groovy.m2eclipse/target/org.codehaus.groovy.m2eclipse-3.6.0-SNAPSHOT-sources.jar to /home/bamboo/.m2/repository/org/codehaus/groovy/eclipse/org.codehaus.groovy.m2eclipse/3.6.0-SNAPSHOT/org.codehaus.groovy.m2eclipse-3.6.0-SNAPSHOT-sources.jar
09-Dec-2019 00:05:47 [INFO] Installing /opt/bamboo-home/xml-data/build-dir/GRECLIPSE-GE49-JOB1/extras/org.codehaus.groovy.m2eclipse/target/p2content.xml to /home/bamboo/.m2/repository/org/codehaus/groovy/eclipse/org.codehaus.groovy.m2eclipse/3.6.0-SNAPSHOT/org.codehaus.groovy.m2eclipse-3.6.0-SNAPSHOT-p2metadata.xml
09-Dec-2019 00:05:47 [INFO] Installing /opt/bamboo-home/xml-data/build-dir/GRECLIPSE-GE49-JOB1/extras/org.codehaus.groovy.m2eclipse/target/p2artifacts.xml to /home/bamboo/.m2/repository/org/codehaus/groovy/eclipse/org.codehaus.groovy.m2eclipse/3.6.0-SNAPSHOT/org.codehaus.groovy.m2eclipse-3.6.0-SNAPSHOT-p2artifacts.xml
09-Dec-2019 00:05:47 [INFO] Installing /opt/bamboo-home/xml-data/build-dir/GRECLIPSE-GE49-JOB1/extras/org.codehaus.groovy.m2eclipse/target/p2content.xml to /home/bamboo/.m2/repository/org/codehaus/groovy/eclipse/org.codehaus.groovy.m2eclipse/3.6.0-SNAPSHOT/org.codehaus.groovy.m2eclipse-3.6.0-SNAPSHOT-p2metadata.xml
09-Dec-2019 00:05:47 [INFO] Installing /opt/bamboo-home/xml-data/build-dir/GRECLIPSE-GE49-JOB1/extras/org.codehaus.groovy.m2eclipse/target/p2artifacts.xml to /home/bamboo/.m2/repository/org/codehaus/groovy/eclipse/org.codehaus.groovy.m2eclipse/3.6.0-SNAPSHOT/org.codehaus.groovy.m2eclipse-3.6.0-SNAPSHOT-p2artifacts.xml
09-Dec-2019 00:05:47 [INFO]
09-Dec-2019 00:05:47 [INFO] --- tycho-p2-plugin:1.5.0:update-local-index (default-update-local-index) @ org.codehaus.groovy.m2eclipse ---
09-Dec-2019 00:05:47 [INFO]
09-Dec-2019 00:05:47 [INFO] --- maven-deploy-plugin:2.8.2:deploy (default-deploy) @ org.codehaus.groovy.m2eclipse ---
09-Dec-2019 00:05:47 [INFO] Skipping artifact deployment
09-Dec-2019 00:05:47 [INFO]
09-Dec-2019 00:05:47 [INFO] --< org.codehaus.groovy.eclipse:org.codehaus.groovy.m2eclipse.feature >--
09-Dec-2019 00:05:47 [INFO] Building org.codehaus.groovy.m2eclipse.feature 3.6.0-SNAPSHOT    [39/40]
09-Dec-2019 00:05:47 [INFO] --------------------------[ eclipse-feature ]---------------------------
09-Dec-2019 00:05:47 [INFO]
09-Dec-2019 00:05:47 [INFO] --- maven-clean-plugin:2.5:clean (default-clean) @ org.codehaus.groovy.m2eclipse.feature ---
09-Dec-2019 00:05:47 [INFO] Deleting /opt/bamboo-home/xml-data/build-dir/GRECLIPSE-GE49-JOB1/extras/Feature-org.codehaus.groovy.m2eclipse/target
09-Dec-2019 00:05:47 [INFO]
09-Dec-2019 00:05:47 [INFO] --- tycho-packaging-plugin:1.5.0:build-qualifier-aggregator (default-build-qualifier-aggregator) @ org.codehaus.groovy.m2eclipse.feature ---
09-Dec-2019 00:05:47 [INFO] The project's OSGi version is 3.6.0.v201912082230-e1809
09-Dec-2019 00:05:47 [INFO]
09-Dec-2019 00:05:47 [INFO] --- tycho-packaging-plugin:1.5.0:validate-id (default-validate-id) @ org.codehaus.groovy.m2eclipse.feature ---
09-Dec-2019 00:05:47 [INFO]
09-Dec-2019 00:05:47 [INFO] --- tycho-packaging-plugin:1.5.0:validate-version (default-validate-version) @ org.codehaus.groovy.m2eclipse.feature ---
09-Dec-2019 00:05:47 [INFO]
09-Dec-2019 00:05:47 [INFO] --- properties-maven-plugin:1.0.0:read-project-properties (default) @ org.codehaus.groovy.m2eclipse.feature ---
09-Dec-2019 00:05:47 [INFO]
09-Dec-2019 00:05:47 [INFO] --- tycho-source-plugin:1.5.0:plugin-source (plugin-source) @ org.codehaus.groovy.m2eclipse.feature ---
09-Dec-2019 00:05:47 [INFO]
09-Dec-2019 00:05:47 [INFO] --- target-platform-configuration:1.5.0:target-platform (default-target-platform) @ org.codehaus.groovy.m2eclipse.feature ---
09-Dec-2019 00:05:47 [INFO]
09-Dec-2019 00:05:47 [INFO] --- tycho-packaging-plugin:1.5.0:package-feature (default-package-feature) @ org.codehaus.groovy.m2eclipse.feature ---
09-Dec-2019 00:05:47 [INFO] Building jar: /opt/bamboo-home/xml-data/build-dir/GRECLIPSE-GE49-JOB1/extras/Feature-org.codehaus.groovy.m2eclipse/target/org.codehaus.groovy.m2eclipse.feature-3.6.0-SNAPSHOT.jar
09-Dec-2019 00:05:47 [INFO]
09-Dec-2019 00:05:47 [INFO] --- tycho-p2-plugin:1.5.0:p2-metadata-default (default-p2-metadata-default) @ org.codehaus.groovy.m2eclipse.feature ---
09-Dec-2019 00:05:47 [INFO]
09-Dec-2019 00:05:47 [INFO] --- tycho-p2-plugin:1.5.0:feature-p2-metadata (default-feature-p2-metadata) @ org.codehaus.groovy.m2eclipse.feature ---
09-Dec-2019 00:05:47 [INFO]
09-Dec-2019 00:05:47 [INFO] --- maven-jarsigner-plugin:3.0.0:sign (sign) @ org.codehaus.groovy.m2eclipse.feature ---
09-Dec-2019 00:05:47 [INFO] 1 archive(s) processed
09-Dec-2019 00:05:47 [INFO]
09-Dec-2019 00:05:47 [INFO] --- tycho-source-feature-plugin:1.5.0:source-feature (source-feature) @ org.codehaus.groovy.m2eclipse.feature ---
09-Dec-2019 00:05:47 [INFO] Building jar: /opt/bamboo-home/xml-data/build-dir/GRECLIPSE-GE49-JOB1/extras/Feature-org.codehaus.groovy.m2eclipse/target/org.codehaus.groovy.m2eclipse.feature-3.6.0-SNAPSHOT-sources-feature.jar
09-Dec-2019 00:05:47 [INFO]
09-Dec-2019 00:05:47 [INFO] --- tycho-p2-plugin:1.5.0:p2-metadata (attach-p2-metadata) @ org.codehaus.groovy.m2eclipse.feature ---
09-Dec-2019 00:05:47 [INFO]
09-Dec-2019 00:05:47 [INFO] --- maven-install-plugin:2.3.1:install (default-install) @ org.codehaus.groovy.m2eclipse.feature ---
09-Dec-2019 00:05:47 [INFO] Installing /opt/bamboo-home/xml-data/build-dir/GRECLIPSE-GE49-JOB1/extras/Feature-org.codehaus.groovy.m2eclipse/target/org.codehaus.groovy.m2eclipse.feature-3.6.0-SNAPSHOT.jar to /home/bamboo/.m2/repository/org/codehaus/groovy/eclipse/org.codehaus.groovy.m2eclipse.feature/3.6.0-SNAPSHOT/org.codehaus.groovy.m2eclipse.feature-3.6.0-SNAPSHOT.jar
09-Dec-2019 00:05:47 [INFO] Installing /opt/bamboo-home/xml-data/build-dir/GRECLIPSE-GE49-JOB1/extras/Feature-org.codehaus.groovy.m2eclipse/pom.xml to /home/bamboo/.m2/repository/org/codehaus/groovy/eclipse/org.codehaus.groovy.m2eclipse.feature/3.6.0-SNAPSHOT/org.codehaus.groovy.m2eclipse.feature-3.6.0-SNAPSHOT.pom
09-Dec-2019 00:05:47 [INFO] Installing /opt/bamboo-home/xml-data/build-dir/GRECLIPSE-GE49-JOB1/extras/Feature-org.codehaus.groovy.m2eclipse/target/p2content.xml to /home/bamboo/.m2/repository/org/codehaus/groovy/eclipse/org.codehaus.groovy.m2eclipse.feature/3.6.0-SNAPSHOT/org.codehaus.groovy.m2eclipse.feature-3.6.0-SNAPSHOT-p2metadata.xml
09-Dec-2019 00:05:47 [INFO] Installing /opt/bamboo-home/xml-data/build-dir/GRECLIPSE-GE49-JOB1/extras/Feature-org.codehaus.groovy.m2eclipse/target/p2artifacts.xml to /home/bamboo/.m2/repository/org/codehaus/groovy/eclipse/org.codehaus.groovy.m2eclipse.feature/3.6.0-SNAPSHOT/org.codehaus.groovy.m2eclipse.feature-3.6.0-SNAPSHOT-p2artifacts.xml
09-Dec-2019 00:05:47 [INFO] Installing /opt/bamboo-home/xml-data/build-dir/GRECLIPSE-GE49-JOB1/extras/Feature-org.codehaus.groovy.m2eclipse/target/org.codehaus.groovy.m2eclipse.feature-3.6.0-SNAPSHOT-sources-feature.jar to /home/bamboo/.m2/repository/org/codehaus/groovy/eclipse/org.codehaus.groovy.m2eclipse.feature/3.6.0-SNAPSHOT/org.codehaus.groovy.m2eclipse.feature-3.6.0-SNAPSHOT-sources-feature.jar
09-Dec-2019 00:05:47 [INFO] Installing /opt/bamboo-home/xml-data/build-dir/GRECLIPSE-GE49-JOB1/extras/Feature-org.codehaus.groovy.m2eclipse/target/p2content.xml to /home/bamboo/.m2/repository/org/codehaus/groovy/eclipse/org.codehaus.groovy.m2eclipse.feature/3.6.0-SNAPSHOT/org.codehaus.groovy.m2eclipse.feature-3.6.0-SNAPSHOT-p2metadata.xml
09-Dec-2019 00:05:47 [INFO] Installing /opt/bamboo-home/xml-data/build-dir/GRECLIPSE-GE49-JOB1/extras/Feature-org.codehaus.groovy.m2eclipse/target/p2artifacts.xml to /home/bamboo/.m2/repository/org/codehaus/groovy/eclipse/org.codehaus.groovy.m2eclipse.feature/3.6.0-SNAPSHOT/org.codehaus.groovy.m2eclipse.feature-3.6.0-SNAPSHOT-p2artifacts.xml
09-Dec-2019 00:05:47 [INFO]
09-Dec-2019 00:05:47 [INFO] --- tycho-p2-plugin:1.5.0:update-local-index (default-update-local-index) @ org.codehaus.groovy.m2eclipse.feature ---
09-Dec-2019 00:05:47 [INFO]
09-Dec-2019 00:05:47 [INFO] --- maven-deploy-plugin:2.8.2:deploy (default-deploy) @ org.codehaus.groovy.m2eclipse.feature ---
09-Dec-2019 00:05:47 [INFO] Skipping artifact deployment
09-Dec-2019 00:05:47 [INFO]
09-Dec-2019 00:05:47 [INFO] ----< org.codehaus.groovy.eclipse:org.codehaus.groovy.eclipse.site >----
09-Dec-2019 00:05:47 [INFO] Building org.codehaus.groovy.eclipse.site 3.6.0-SNAPSHOT         [40/40]
09-Dec-2019 00:05:47 [INFO] ------------------------[ eclipse-update-site ]-------------------------
09-Dec-2019 00:05:47 [INFO]
09-Dec-2019 00:05:47 [INFO] --- maven-clean-plugin:2.5:clean (default-clean) @ org.codehaus.groovy.eclipse.site ---
09-Dec-2019 00:05:47 [INFO]
09-Dec-2019 00:05:47 [INFO] --- tycho-packaging-plugin:1.5.0:build-qualifier (default-build-qualifier) @ org.codehaus.groovy.eclipse.site ---
09-Dec-2019 00:05:48 [INFO] The project's OSGi version is 3.6.0.v201912082230-e1809
09-Dec-2019 00:05:48 [INFO]
09-Dec-2019 00:05:48 [INFO] --- properties-maven-plugin:1.0.0:read-project-properties (default) @ org.codehaus.groovy.eclipse.site ---
09-Dec-2019 00:05:48 [INFO]
09-Dec-2019 00:05:48 [INFO] --- tycho-source-plugin:1.5.0:plugin-source (plugin-source) @ org.codehaus.groovy.eclipse.site ---
09-Dec-2019 00:05:48 [INFO]
09-Dec-2019 00:05:48 [INFO] --- tycho-packaging-plugin:1.5.0:update-site (default-update-site) @ org.codehaus.groovy.eclipse.site ---
09-Dec-2019 00:05:48 [INFO]
09-Dec-2019 00:05:48 [INFO] --- tycho-p2-plugin:1.5.0:update-site-p2-metadata (default-update-site-p2-metadata) @ org.codehaus.groovy.eclipse.site ---
09-Dec-2019 00:05:48 [INFO] Command line:
09-Dec-2019 00:05:48         [/opt/jdk8u232-b09/jre/bin/java, -jar, /opt/users/bamboo/.m2/repository/org/eclipse/tycho/tycho-bundles-external/1.5.0/eclipse/plugins/org.eclipse.equinox.launcher_1.5.500.v20190715-1310.jar, -configuration, /tmp/GRECLIPSE-GE49-JOB1/tycho-p2-runtime310859840595423509.tmp/configuration, -nosplash, -application, org.eclipse.equinox.p2.publisher.UpdateSitePublisher, -source, /opt/bamboo-home/xml-data/build-dir/GRECLIPSE-GE49-JOB1/Site-org.codehaus.groovy.eclipse/target/site, -metadataRepository, file:/opt/bamboo-home/xml-data/build-dir/GRECLIPSE-GE49-JOB1/Site-org.codehaus.groovy.eclipse/target/site/, -metadataRepositoryName, org.codehaus.groovy.eclipse.site, -artifactRepository, file:/opt/bamboo-home/xml-data/build-dir/GRECLIPSE-GE49-JOB1/Site-org.codehaus.groovy.eclipse/target/site/, -artifactRepositoryName, org.codehaus.groovy.eclipse.site Artifacts, -noDefaultIUs, -compress]
09-Dec-2019 00:05:49 Generating metadata for ..
09-Dec-2019 00:05:50 Generation completed with success [0 seconds].
09-Dec-2019 00:05:50 [INFO]
09-Dec-2019 00:05:50 [INFO] --- tycho-packaging-plugin:1.5.0:update-site-packaging (default-update-site-packaging) @ org.codehaus.groovy.eclipse.site ---
09-Dec-2019 00:05:50 [INFO] Building zip: /opt/bamboo-home/xml-data/build-dir/GRECLIPSE-GE49-JOB1/Site-org.codehaus.groovy.eclipse/target/site.zip
09-Dec-2019 00:05:50 [INFO]
09-Dec-2019 00:05:50 [INFO] --- maven-jarsigner-plugin:3.0.0:sign (sign) @ org.codehaus.groovy.eclipse.site ---
09-Dec-2019 00:05:50 [INFO] 1 archive(s) processed
09-Dec-2019 00:05:50 [INFO]
09-Dec-2019 00:05:50 [INFO] --- tycho-source-feature-plugin:1.5.0:source-feature (source-feature) @ org.codehaus.groovy.eclipse.site ---
09-Dec-2019 00:05:50 [INFO]
09-Dec-2019 00:05:50 [INFO] --- tycho-p2-plugin:1.5.0:p2-metadata (attach-p2-metadata) @ org.codehaus.groovy.eclipse.site ---
09-Dec-2019 00:05:50 [INFO]
09-Dec-2019 00:05:50 [INFO] --- maven-install-plugin:2.3.1:install (default-install) @ org.codehaus.groovy.eclipse.site ---
09-Dec-2019 00:05:50 [INFO] Installing /opt/bamboo-home/xml-data/build-dir/GRECLIPSE-GE49-JOB1/Site-org.codehaus.groovy.eclipse/target/site.zip to /home/bamboo/.m2/repository/org/codehaus/groovy/eclipse/org.codehaus.groovy.eclipse.site/3.6.0-SNAPSHOT/org.codehaus.groovy.eclipse.site-3.6.0-SNAPSHOT.zip
09-Dec-2019 00:05:50 [INFO] Installing /opt/bamboo-home/xml-data/build-dir/GRECLIPSE-GE49-JOB1/Site-org.codehaus.groovy.eclipse/pom.xml to /home/bamboo/.m2/repository/org/codehaus/groovy/eclipse/org.codehaus.groovy.eclipse.site/3.6.0-SNAPSHOT/org.codehaus.groovy.eclipse.site-3.6.0-SNAPSHOT.pom
09-Dec-2019 00:05:50 [INFO]
09-Dec-2019 00:05:50 [INFO] --- maven-deploy-plugin:2.8.2:deploy (default-deploy) @ org.codehaus.groovy.eclipse.site ---
09-Dec-2019 00:05:50 [INFO] Skipping artifact deployment
09-Dec-2019 00:05:50 [INFO]
09-Dec-2019 00:05:50 [INFO] --- maven-antrun-plugin:1.8:run (upload-dist) @ org.codehaus.groovy.eclipse.site ---
09-Dec-2019 00:05:50 [INFO] Executing tasks
09-Dec-2019 00:05:50
09-Dec-2019 00:05:50 main:
09-Dec-2019 00:05:50      [echo] Uploading main update site to s3..."
09-Dec-2019 00:05:51      [echo] == Are props set so we can deploy? ==
09-Dec-2019 00:05:51      [echo] dist_properties=/home/bamboo/tools/s3.properties
09-Dec-2019 00:05:51      [echo] bamboo_s3_properties=/home/bamboo/tools/s3.properties
09-Dec-2019 00:05:51      [echo] dist.full.version=3.6.0.v201912082230-e1809
09-Dec-2019 00:05:51      [echo] dist.file.name=org.codehaus.groovy-3.6.0.v201912082230-e1809-updatesite.zip
09-Dec-2019 00:05:51       [zip] Building zip: /opt/bamboo-home/xml-data/build-dir/GRECLIPSE-GE49-JOB1/Site-org.codehaus.groovy.eclipse/target/org.codehaus.groovy-3.6.0.v201912082230-e1809-updatesite.zip
09-Dec-2019 00:05:54      [echo] Preparing for upload...
09-Dec-2019 00:05:54      [echo] Will Delete:
09-Dec-2019 00:05:54      [echo] dist.bucket=dist.springsource.org
09-Dec-2019 00:05:54      [echo] dist.path=snapshot/GRECLIPSE/e4.9
09-Dec-2019 00:05:54      [echo] Will Upload:
09-Dec-2019 00:05:54      [echo] dist.bucket=dist.springsource.org
09-Dec-2019 00:05:54      [echo] fromDir=/opt/bamboo-home/xml-data/build-dir/GRECLIPSE-GE49-JOB1/Site-org.codehaus.groovy.eclipse/target/site
09-Dec-2019 00:05:54      [echo] toDir=snapshot/GRECLIPSE/e4.9
09-Dec-2019 00:05:54      [echo] Will Upload:
09-Dec-2019 00:05:54      [echo] dist.bucket=dist.springsource.org
09-Dec-2019 00:05:54      [echo] fromFile=/opt/bamboo-home/xml-data/build-dir/GRECLIPSE-GE49-JOB1/Site-org.codehaus.groovy.eclipse/target/org.codehaus.groovy-3.6.0.v201912082230-e1809-updatesite.zip
09-Dec-2019 00:05:54      [echo] toFile=snapshot/GRECLIPSE/e4.9/org.codehaus.groovy-3.6.0.v201912082230-e1809-updatesite.zip
09-Dec-2019 00:05:54      [echo] metadata bundle.version=3.6.0.v201912082230-e1809
09-Dec-2019 00:05:54      [echo] metadata package.file.name=org.codehaus.groovy-3.6.0.v201912082230-e1809-updatesite.zip
09-Dec-2019 00:05:54      [echo] metadata project.name=Groovy Development Tools
09-Dec-2019 00:05:54      [echo] metadata release.type=snapshot
09-Dec-2019 00:05:55 Deleted s3://dist.springsource.org/snapshot/GRECLIPSE/e4.9/artifacts.jar
09-Dec-2019 00:05:55 Deleted s3://dist.springsource.org/snapshot/GRECLIPSE/e4.9/content.jar
09-Dec-2019 00:05:55 Deleted s3://dist.springsource.org/snapshot/GRECLIPSE/e4.9/features/
09-Dec-2019 00:05:56 Deleted s3://dist.springsource.org/snapshot/GRECLIPSE/e4.9/features/org.codehaus.groovy.compilerless.feature_3.6.0.v201912072321-e1809.jar
09-Dec-2019 00:05:56 Deleted s3://dist.springsource.org/snapshot/GRECLIPSE/e4.9/features/org.codehaus.groovy.eclipse.feature_3.6.0.v201912072321-e1809.jar
09-Dec-2019 00:05:56 Deleted s3://dist.springsource.org/snapshot/GRECLIPSE/e4.9/features/org.codehaus.groovy.headless.feature_3.6.0.v201912072321-e1809.jar
09-Dec-2019 00:05:56 Deleted s3://dist.springsource.org/snapshot/GRECLIPSE/e4.9/features/org.codehaus.groovy.jdt.patch_3.6.0.v201912072321-e1809.jar
09-Dec-2019 00:05:56 Deleted s3://dist.springsource.org/snapshot/GRECLIPSE/e4.9/features/org.codehaus.groovy.m2eclipse.feature_3.6.0.v201912072321-e1809.jar
09-Dec-2019 00:05:56 Deleted s3://dist.springsource.org/snapshot/GRECLIPSE/e4.9/features/org.codehaus.groovy24.feature_3.6.0.v201912072321-e1809.jar
09-Dec-2019 00:05:56 Deleted s3://dist.springsource.org/snapshot/GRECLIPSE/e4.9/features/org.codehaus.groovy25.feature_3.6.0.v201912072321-e1809.jar
09-Dec-2019 00:05:56 Deleted s3://dist.springsource.org/snapshot/GRECLIPSE/e4.9/features/org.codehaus.groovy30.feature_3.6.0.v201912072321-e1809.jar
09-Dec-2019 00:05:56 Deleted s3://dist.springsource.org/snapshot/GRECLIPSE/e4.9/plugins/
09-Dec-2019 00:05:57 Deleted s3://dist.springsource.org/snapshot/GRECLIPSE/e4.9/plugins/org.codehaus.groovy.eclipse.ant_3.6.0.v201912072321-e1809.jar
09-Dec-2019 00:05:57 Deleted s3://dist.springsource.org/snapshot/GRECLIPSE/e4.9/plugins/org.codehaus.groovy.eclipse.astviews_3.6.0.v201912072321-e1809.jar
09-Dec-2019 00:05:57 Deleted s3://dist.springsource.org/snapshot/GRECLIPSE/e4.9/plugins/org.codehaus.groovy.eclipse.codeassist_3.6.0.v201912072321-e1809.jar
09-Dec-2019 00:05:57 Deleted s3://dist.springsource.org/snapshot/GRECLIPSE/e4.9/plugins/org.codehaus.groovy.eclipse.codebrowsing_3.6.0.v201912072321-e1809.jar
09-Dec-2019 00:05:57 Deleted s3://dist.springsource.org/snapshot/GRECLIPSE/e4.9/plugins/org.codehaus.groovy.eclipse.compilerResolver_3.6.0.v201912072321-e1809.jar
09-Dec-2019 00:05:57 Deleted s3://dist.springsource.org/snapshot/GRECLIPSE/e4.9/plugins/org.codehaus.groovy.eclipse.core_3.6.0.v201912072321-e1809.jar
09-Dec-2019 00:05:57 Deleted s3://dist.springsource.org/snapshot/GRECLIPSE/e4.9/plugins/org.codehaus.groovy.eclipse.dsl_3.6.0.v201912072321-e1809.jar
09-Dec-2019 00:05:57 Deleted s3://dist.springsource.org/snapshot/GRECLIPSE/e4.9/plugins/org.codehaus.groovy.eclipse.quickfix_3.6.0.v201912072321-e1809.jar
09-Dec-2019 00:05:57 Deleted s3://dist.springsource.org/snapshot/GRECLIPSE/e4.9/plugins/org.codehaus.groovy.eclipse.refactoring_3.6.0.v201912072321-e1809.jar
09-Dec-2019 00:05:57 Deleted s3://dist.springsource.org/snapshot/GRECLIPSE/e4.9/plugins/org.codehaus.groovy.eclipse.ui_3.6.0.v201912072321-e1809.jar
09-Dec-2019 00:05:58 Deleted s3://dist.springsource.org/snapshot/GRECLIPSE/e4.9/plugins/org.codehaus.groovy.eclipse_3.6.0.v201912072321-e1809.jar
09-Dec-2019 00:05:58 Deleted s3://dist.springsource.org/snapshot/GRECLIPSE/e4.9/plugins/org.codehaus.groovy.m2eclipse_3.6.0.v201912072321-e1809.jar
09-Dec-2019 00:05:58 Deleted s3://dist.springsource.org/snapshot/GRECLIPSE/e4.9/plugins/org.codehaus.groovy_2.4.17.v201912072321-e1809.jar
09-Dec-2019 00:05:58 Deleted s3://dist.springsource.org/snapshot/GRECLIPSE/e4.9/plugins/org.codehaus.groovy_2.5.8.v201912072321-e1809.jar
09-Dec-2019 00:05:58 Deleted s3://dist.springsource.org/snapshot/GRECLIPSE/e4.9/plugins/org.codehaus.groovy_3.0.0.v201912072321-e1809.jar
09-Dec-2019 00:05:58 Deleted s3://dist.springsource.org/snapshot/GRECLIPSE/e4.9/plugins/org.eclipse.jdt.core_3.15.100.v201912072321-e1809.jar
09-Dec-2019 00:05:58 Deleted s3://dist.springsource.org/snapshot/GRECLIPSE/e4.9/plugins/org.eclipse.jdt.groovy.core_3.6.0.v201912072321-e1809.jar
09-Dec-2019 00:05:58 Deleted s3://dist.springsource.org/snapshot/GRECLIPSE/e4.9/site.xml
09-Dec-2019 00:05:58 Uploading /opt/bamboo-home/xml-data/build-dir/GRECLIPSE-GE49-JOB1/Site-org.codehaus.groovy.eclipse/target/site/artifacts.jar (2.8 KB) to s3://dist.springsource.org/snapshot/GRECLIPSE/e4.9/artifacts.jar
09-Dec-2019 00:05:59 Transfer Time: .2 s - Transfer Rate: 16.4 KB/s
09-Dec-2019 00:05:59 Uploading /opt/bamboo-home/xml-data/build-dir/GRECLIPSE-GE49-JOB1/Site-org.codehaus.groovy.eclipse/target/site/content.jar (11.5 KB) to s3://dist.springsource.org/snapshot/GRECLIPSE/e4.9/content.jar
09-Dec-2019 00:05:59 Transfer Time: .2 s - Transfer Rate: 57.1 KB/s
09-Dec-2019 00:06:00 Uploading /opt/bamboo-home/xml-data/build-dir/GRECLIPSE-GE49-JOB1/Site-org.codehaus.groovy.eclipse/target/site/features/org.codehaus.groovy.compilerless.feature_3.6.0.v201912082230-e1809.jar (15.0 KB) to s3://dist.springsource.org/snapshot/GRECLIPSE/e4.9/features/org.codehaus.groovy.compilerless.feature_3.6.0.v201912082230-e1809.jar
09-Dec-2019 00:06:00 Transfer Time: .2 s - Transfer Rate: 72.6 KB/s
09-Dec-2019 00:06:00 Uploading /opt/bamboo-home/xml-data/build-dir/GRECLIPSE-GE49-JOB1/Site-org.codehaus.groovy.eclipse/target/site/features/org.codehaus.groovy.eclipse.feature_3.6.0.v201912082230-e1809.jar (14.9 KB) to s3://dist.springsource.org/snapshot/GRECLIPSE/e4.9/features/org.codehaus.groovy.eclipse.feature_3.6.0.v201912082230-e1809.jar
09-Dec-2019 00:06:00 Transfer Time: .2 s - Transfer Rate: 63.1 KB/s
09-Dec-2019 00:06:01 Uploading /opt/bamboo-home/xml-data/build-dir/GRECLIPSE-GE49-JOB1/Site-org.codehaus.groovy.eclipse/target/site/features/org.codehaus.groovy.headless.feature_3.6.0.v201912082230-e1809.jar (14.9 KB) to s3://dist.springsource.org/snapshot/GRECLIPSE/e4.9/features/org.codehaus.groovy.headless.feature_3.6.0.v201912082230-e1809.jar
09-Dec-2019 00:06:01 Transfer Time: .2 s - Transfer Rate: 83.3 KB/s
09-Dec-2019 00:06:01 Uploading /opt/bamboo-home/xml-data/build-dir/GRECLIPSE-GE49-JOB1/Site-org.codehaus.groovy.eclipse/target/site/features/org.codehaus.groovy.jdt.patch_3.6.0.v201912082230-e1809.jar (9.3 KB) to s3://dist.springsource.org/snapshot/GRECLIPSE/e4.9/features/org.codehaus.groovy.jdt.patch_3.6.0.v201912082230-e1809.jar
09-Dec-2019 00:06:01 Transfer Time: .2 s - Transfer Rate: 53.2 KB/s
09-Dec-2019 00:06:02 Uploading /opt/bamboo-home/xml-data/build-dir/GRECLIPSE-GE49-JOB1/Site-org.codehaus.groovy.eclipse/target/site/features/org.codehaus.groovy.m2eclipse.feature_3.6.0.v201912082230-e1809.jar (14.9 KB) to s3://dist.springsource.org/snapshot/GRECLIPSE/e4.9/features/org.codehaus.groovy.m2eclipse.feature_3.6.0.v201912082230-e1809.jar
09-Dec-2019 00:06:02 Transfer Time: .2 s - Transfer Rate: 81.4 KB/s
09-Dec-2019 00:06:03 Uploading /opt/bamboo-home/xml-data/build-dir/GRECLIPSE-GE49-JOB1/Site-org.codehaus.groovy.eclipse/target/site/features/org.codehaus.groovy24.feature_3.6.0.v201912082230-e1809.jar (14.8 KB) to s3://dist.springsource.org/snapshot/GRECLIPSE/e4.9/features/org.codehaus.groovy24.feature_3.6.0.v201912082230-e1809.jar
09-Dec-2019 00:06:03 Transfer Time: .2 s - Transfer Rate: 68.1 KB/s
09-Dec-2019 00:06:03 Uploading /opt/bamboo-home/xml-data/build-dir/GRECLIPSE-GE49-JOB1/Site-org.codehaus.groovy.eclipse/target/site/features/org.codehaus.groovy25.feature_3.6.0.v201912082230-e1809.jar (14.8 KB) to s3://dist.springsource.org/snapshot/GRECLIPSE/e4.9/features/org.codehaus.groovy25.feature_3.6.0.v201912082230-e1809.jar
09-Dec-2019 00:06:03 Transfer Time: .3 s - Transfer Rate: 52.8 KB/s
09-Dec-2019 00:06:04 Uploading /opt/bamboo-home/xml-data/build-dir/GRECLIPSE-GE49-JOB1/Site-org.codehaus.groovy.eclipse/target/site/features/org.codehaus.groovy30.feature_3.6.0.v201912082230-e1809.jar (14.8 KB) to s3://dist.springsource.org/snapshot/GRECLIPSE/e4.9/features/org.codehaus.groovy30.feature_3.6.0.v201912082230-e1809.jar
09-Dec-2019 00:06:04 Transfer Time: .2 s - Transfer Rate: 78.9 KB/s
09-Dec-2019 00:06:05 Uploading /opt/bamboo-home/xml-data/build-dir/GRECLIPSE-GE49-JOB1/Site-org.codehaus.groovy.eclipse/target/site/plugins/org.codehaus.groovy.eclipse.ant_3.6.0.v201912082230-e1809.jar (11.5 KB) to s3://dist.springsource.org/snapshot/GRECLIPSE/e4.9/plugins/org.codehaus.groovy.eclipse.ant_3.6.0.v201912082230-e1809.jar
09-Dec-2019 00:06:05 Transfer Time: .2 s - Transfer Rate: 70.3 KB/s
09-Dec-2019 00:06:05 Uploading /opt/bamboo-home/xml-data/build-dir/GRECLIPSE-GE49-JOB1/Site-org.codehaus.groovy.eclipse/target/site/plugins/org.codehaus.groovy.eclipse.astviews_3.6.0.v201912082230-e1809.jar (79.2 KB) to s3://dist.springsource.org/snapshot/GRECLIPSE/e4.9/plugins/org.codehaus.groovy.eclipse.astviews_3.6.0.v201912082230-e1809.jar
09-Dec-2019 00:06:06 Transfer Time: .3 s - Transfer Rate: 259.6 KB/s
09-Dec-2019 00:06:06 Uploading /opt/bamboo-home/xml-data/build-dir/GRECLIPSE-GE49-JOB1/Site-org.codehaus.groovy.eclipse/target/site/plugins/org.codehaus.groovy.eclipse.codeassist_3.6.0.v201912082230-e1809.jar (273.9 KB) to s3://dist.springsource.org/snapshot/GRECLIPSE/e4.9/plugins/org.codehaus.groovy.eclipse.codeassist_3.6.0.v201912082230-e1809.jar
09-Dec-2019 00:06:07 Transfer Time: .4 s - Transfer Rate: 720.9 KB/s
09-Dec-2019 00:06:07 Uploading /opt/bamboo-home/xml-data/build-dir/GRECLIPSE-GE49-JOB1/Site-org.codehaus.groovy.eclipse/target/site/plugins/org.codehaus.groovy.eclipse.codebrowsing_3.6.0.v201912082230-e1809.jar (86.8 KB) to s3://dist.springsource.org/snapshot/GRECLIPSE/e4.9/plugins/org.codehaus.groovy.eclipse.codebrowsing_3.6.0.v201912082230-e1809.jar
09-Dec-2019 00:06:07 Transfer Time: .2 s - Transfer Rate: 411.5 KB/s
09-Dec-2019 00:06:08 Uploading /opt/bamboo-home/xml-data/build-dir/GRECLIPSE-GE49-JOB1/Site-org.codehaus.groovy.eclipse/target/site/plugins/org.codehaus.groovy.eclipse.compilerResolver_3.6.0.v201912082230-e1809.jar (20.4 KB) to s3://dist.springsource.org/snapshot/GRECLIPSE/e4.9/plugins/org.codehaus.groovy.eclipse.compilerResolver_3.6.0.v201912082230-e1809.jar
09-Dec-2019 00:06:08 Transfer Time: .3 s - Transfer Rate: 70.9 KB/s
09-Dec-2019 00:06:08 Uploading /opt/bamboo-home/xml-data/build-dir/GRECLIPSE-GE49-JOB1/Site-org.codehaus.groovy.eclipse/target/site/plugins/org.codehaus.groovy.eclipse.core_3.6.0.v201912082230-e1809.jar (83.4 KB) to s3://dist.springsource.org/snapshot/GRECLIPSE/e4.9/plugins/org.codehaus.groovy.eclipse.core_3.6.0.v201912082230-e1809.jar
09-Dec-2019 00:06:09 Transfer Time: .2 s - Transfer Rate: 347.4 KB/s
09-Dec-2019 00:06:09 Uploading /opt/bamboo-home/xml-data/build-dir/GRECLIPSE-GE49-JOB1/Site-org.codehaus.groovy.eclipse/target/site/plugins/org.codehaus.groovy.eclipse.dsl_3.6.0.v201912082230-e1809.jar (395.7 KB) to s3://dist.springsource.org/snapshot/GRECLIPSE/e4.9/plugins/org.codehaus.groovy.eclipse.dsl_3.6.0.v201912082230-e1809.jar
09-Dec-2019 00:06:10 Transfer Time: .3 s - Transfer Rate: 1.1 MB/s
09-Dec-2019 00:06:10 Uploading /opt/bamboo-home/xml-data/build-dir/GRECLIPSE-GE49-JOB1/Site-org.codehaus.groovy.eclipse/target/site/plugins/org.codehaus.groovy.eclipse.quickfix_3.6.0.v201912082230-e1809.jar (110.7 KB) to s3://dist.springsource.org/snapshot/GRECLIPSE/e4.9/plugins/org.codehaus.groovy.eclipse.quickfix_3.6.0.v201912082230-e1809.jar
09-Dec-2019 00:06:10 Transfer Time: .2 s - Transfer Rate: 651.0 KB/s
09-Dec-2019 00:06:11 Uploading /opt/bamboo-home/xml-data/build-dir/GRECLIPSE-GE49-JOB1/Site-org.codehaus.groovy.eclipse/target/site/plugins/org.codehaus.groovy.eclipse.refactoring_3.6.0.v201912082230-e1809.jar (272.3 KB) to s3://dist.springsource.org/snapshot/GRECLIPSE/e4.9/plugins/org.codehaus.groovy.eclipse.refactoring_3.6.0.v201912082230-e1809.jar
09-Dec-2019 00:06:11 Transfer Time: .2 s - Transfer Rate: 1.3 MB/s
09-Dec-2019 00:06:11 Uploading /opt/bamboo-home/xml-data/build-dir/GRECLIPSE-GE49-JOB1/Site-org.codehaus.groovy.eclipse/target/site/plugins/org.codehaus.groovy.eclipse.ui_3.6.0.v201912082230-e1809.jar (551.9 KB) to s3://dist.springsource.org/snapshot/GRECLIPSE/e4.9/plugins/org.codehaus.groovy.eclipse.ui_3.6.0.v201912082230-e1809.jar
09-Dec-2019 00:06:11 Transfer Time: .3 s - Transfer Rate: 1.9 MB/s
09-Dec-2019 00:06:12 Uploading /opt/bamboo-home/xml-data/build-dir/GRECLIPSE-GE49-JOB1/Site-org.codehaus.groovy.eclipse/target/site/plugins/org.codehaus.groovy.eclipse_3.6.0.v201912082230-e1809.jar (16.7 KB) to s3://dist.springsource.org/snapshot/GRECLIPSE/e4.9/plugins/org.codehaus.groovy.eclipse_3.6.0.v201912082230-e1809.jar
09-Dec-2019 00:06:12 Transfer Time: .2 s - Transfer Rate: 104.3 KB/s
09-Dec-2019 00:06:13 Uploading /opt/bamboo-home/xml-data/build-dir/GRECLIPSE-GE49-JOB1/Site-org.codehaus.groovy.eclipse/target/site/plugins/org.codehaus.groovy.m2eclipse_3.6.0.v201912082230-e1809.jar (17.9 KB) to s3://dist.springsource.org/snapshot/GRECLIPSE/e4.9/plugins/org.codehaus.groovy.m2eclipse_3.6.0.v201912082230-e1809.jar
09-Dec-2019 00:06:13 Transfer Time: .2 s - Transfer Rate: 83.2 KB/s
09-Dec-2019 00:06:13 Uploading /opt/bamboo-home/xml-data/build-dir/GRECLIPSE-GE49-JOB1/Site-org.codehaus.groovy.eclipse/target/site/plugins/org.codehaus.groovy_2.4.17.v201912082230-e1809.jar (18.8 MB) to s3://dist.springsource.org/snapshot/GRECLIPSE/e4.9/plugins/org.codehaus.groovy_2.4.17.v201912082230-e1809.jar
09-Dec-2019 00:06:14 Transfer Time: .8 s - Transfer Rate: 24.0 MB/s
09-Dec-2019 00:06:14 Uploading /opt/bamboo-home/xml-data/build-dir/GRECLIPSE-GE49-JOB1/Site-org.codehaus.groovy.eclipse/target/site/plugins/org.codehaus.groovy_2.5.8.v201912082230-e1809.jar (17.7 MB) to s3://dist.springsource.org/snapshot/GRECLIPSE/e4.9/plugins/org.codehaus.groovy_2.5.8.v201912082230-e1809.jar
09-Dec-2019 00:06:15 Transfer Time: .8 s - Transfer Rate: 22.5 MB/s
09-Dec-2019 00:06:16 Uploading /opt/bamboo-home/xml-data/build-dir/GRECLIPSE-GE49-JOB1/Site-org.codehaus.groovy.eclipse/target/site/plugins/org.codehaus.groovy_3.0.0.v201912082230-e1809.jar (21.9 MB) to s3://dist.springsource.org/snapshot/GRECLIPSE/e4.9/plugins/org.codehaus.groovy_3.0.0.v201912082230-e1809.jar
09-Dec-2019 00:06:17 Transfer Time: .9 s - Transfer Rate: 24.0 MB/s
09-Dec-2019 00:06:17 Uploading /opt/bamboo-home/xml-data/build-dir/GRECLIPSE-GE49-JOB1/Site-org.codehaus.groovy.eclipse/target/site/plugins/org.eclipse.jdt.core_3.15.100.v201912082230-e1809.jar (6.6 MB) to s3://dist.springsource.org/snapshot/GRECLIPSE/e4.9/plugins/org.eclipse.jdt.core_3.15.100.v201912082230-e1809.jar
09-Dec-2019 00:06:17 Transfer Time: .4 s - Transfer Rate: 15.4 MB/s
09-Dec-2019 00:06:18 Uploading /opt/bamboo-home/xml-data/build-dir/GRECLIPSE-GE49-JOB1/Site-org.codehaus.groovy.eclipse/target/site/plugins/org.eclipse.jdt.groovy.core_3.6.0.v201912082230-e1809.jar (460.4 KB) to s3://dist.springsource.org/snapshot/GRECLIPSE/e4.9/plugins/org.eclipse.jdt.groovy.core_3.6.0.v201912082230-e1809.jar
09-Dec-2019 00:06:18 Transfer Time: .2 s - Transfer Rate: 2.5 MB/s
09-Dec-2019 00:06:18 Uploading /opt/bamboo-home/xml-data/build-dir/GRECLIPSE-GE49-JOB1/Site-org.codehaus.groovy.eclipse/target/site/site.xml (2.8 KB) to s3://dist.springsource.org/snapshot/GRECLIPSE/e4.9/site.xml
09-Dec-2019 00:06:18 Transfer Time: .2 s - Transfer Rate: 15.9 KB/s
09-Dec-2019 00:06:19 Uploading /opt/bamboo-home/xml-data/build-dir/GRECLIPSE-GE49-JOB1/Site-org.codehaus.groovy.eclipse/target/org.codehaus.groovy-3.6.0.v201912082230-e1809-updatesite.zip (67.0 MB) to s3://dist.springsource.org/snapshot/GRECLIPSE/e4.9/org.codehaus.groovy-3.6.0.v201912082230-e1809-updatesite.zip
09-Dec-2019 00:06:21 Transfer Time: 2.4 s - Transfer Rate: 28.0 MB/s
09-Dec-2019 00:06:21 Uploading /opt/bamboo-home/xml-data/build-dir/GRECLIPSE-GE49-JOB1/Site-org.codehaus.groovy.eclipse/target/org.codehaus.groovy-3.6.0.v201912082230-e1809-updatesite.zip.md5 (.0 KB) to s3://dist.springsource.org/snapshot/GRECLIPSE/e4.9/org.codehaus.groovy-3.6.0.v201912082230-e1809-updatesite.zip.md5
09-Dec-2019 00:06:22 Transfer Time: .2 s - Transfer Rate: .2 KB/s
09-Dec-2019 00:06:22 Uploading /opt/bamboo-home/xml-data/build-dir/GRECLIPSE-GE49-JOB1/Site-org.codehaus.groovy.eclipse/target/org.codehaus.groovy-3.6.0.v201912082230-e1809-updatesite.zip.sha1 (.0 KB) to s3://dist.springsource.org/snapshot/GRECLIPSE/e4.9/org.codehaus.groovy-3.6.0.v201912082230-e1809-updatesite.zip.sha1
09-Dec-2019 00:06:22 Transfer Time: .2 s - Transfer Rate: .2 KB/s
09-Dec-2019 00:06:22 [INFO] Executed tasks
09-Dec-2019 00:06:22 [INFO] ------------------------------------------------------------------------
09-Dec-2019 00:06:22 [INFO] Reactor Summary:
09-Dec-2019 00:06:22 [INFO]
09-Dec-2019 00:06:22 [INFO] org.codehaus.groovy.eclipse.parent 3.6.0-SNAPSHOT .. SUCCESS [  0.218 s]
09-Dec-2019 00:06:22 [INFO] org.codehaus.groovy 2.4.17-SNAPSHOT ................ SUCCESS [  6.025 s]
09-Dec-2019 00:06:22 [INFO] org.codehaus.groovy 2.5.8-SNAPSHOT ................. SUCCESS [  3.746 s]
09-Dec-2019 00:06:22 [INFO] org.codehaus.groovy 3.0.0-SNAPSHOT ................. SUCCESS [  4.382 s]
09-Dec-2019 00:06:22 [INFO] org.codehaus.groovy.eclipse.compilerResolver ....... SUCCESS [  0.808 s]
09-Dec-2019 00:06:22 [INFO] org.eclipse.jdt.core 3.15.100-SNAPSHOT ............. SUCCESS [  9.694 s]
09-Dec-2019 00:06:22 [INFO] org.eclipse.jdt.groovy.core ........................ SUCCESS [  1.729 s]
09-Dec-2019 00:06:22 [INFO] org.codehaus.groovy.eclipse ........................ SUCCESS [  0.392 s]
09-Dec-2019 00:06:22 [INFO] org.codehaus.groovy.eclipse.core ................... SUCCESS [  0.959 s]
09-Dec-2019 00:06:22 [INFO] org.codehaus.groovy.eclipse.ant .................... SUCCESS [  0.822 s]
09-Dec-2019 00:06:22 [INFO] org.codehaus.groovy.eclipse.codebrowsing ........... SUCCESS [  1.042 s]
09-Dec-2019 00:06:22 [INFO] org.codehaus.groovy.eclipse.refactoring ............ SUCCESS [  1.497 s]
09-Dec-2019 00:06:22 [INFO] org.codehaus.groovy.eclipse.ui ..................... SUCCESS [  1.888 s]
09-Dec-2019 00:06:22 [INFO] org.codehaus.groovy.eclipse.astviews ............... SUCCESS [  2.572 s]
09-Dec-2019 00:06:22 [INFO] org.codehaus.groovy.eclipse.codeassist ............. SUCCESS [  1.359 s]
09-Dec-2019 00:06:22 [INFO] org.codehaus.groovy.eclipse.dsl .................... SUCCESS [  1.561 s]
09-Dec-2019 00:06:22 [INFO] org.codehaus.groovy.eclipse.quickfix ............... SUCCESS [  1.129 s]
09-Dec-2019 00:06:22 [INFO] org.codehaus.groovy24.feature ...................... SUCCESS [  0.492 s]
09-Dec-2019 00:06:22 [INFO] org.codehaus.groovy25.feature ...................... SUCCESS [  0.443 s]
09-Dec-2019 00:06:22 [INFO] org.codehaus.groovy30.feature ...................... SUCCESS [  0.414 s]
09-Dec-2019 00:06:22 [INFO] org.codehaus.groovy.jdt.patch ...................... SUCCESS [  0.403 s]
09-Dec-2019 00:06:22 [INFO] org.codehaus.groovy.headless.feature ............... SUCCESS [  0.564 s]
09-Dec-2019 00:06:22 [INFO] org.codehaus.groovy.compilerless.feature ........... SUCCESS [  0.652 s]
09-Dec-2019 00:06:22 [INFO] org.codehaus.groovy.eclipse.feature ................ SUCCESS [  0.455 s]
09-Dec-2019 00:06:22 [INFO] org.eclipse.jdt.core.tests.compiler 3.12.600-SNAPSHOT SUCCESS [  4.257 s]
09-Dec-2019 00:06:22 [INFO] org.eclipse.jdt.core.tests.builder 3.10.300-SNAPSHOT SUCCESS [  1.107 s]
09-Dec-2019 00:06:22 [INFO] org.eclipse.jdt.groovy.core.tests.compiler ......... SUCCESS [  1.084 s]
09-Dec-2019 00:06:22 [INFO] org.eclipse.jdt.groovy.core.tests.builder .......... SUCCESS [  1.336 s]
09-Dec-2019 00:06:22 [INFO] org.codehaus.groovy.eclipse.tests .................. SUCCESS [  2.909 s]
09-Dec-2019 00:06:22 [INFO] org.codehaus.groovy.eclipse.codeassist.test ........ SUCCESS [  1.932 s]
09-Dec-2019 00:06:22 [INFO] org.codehaus.groovy.eclipse.codebrowsing.test ...... SUCCESS [  1.649 s]
09-Dec-2019 00:06:22 [INFO] org.codehaus.groovy.eclipse.core.test .............. SUCCESS [  1.228 s]
09-Dec-2019 00:06:22 [INFO] org.codehaus.groovy.eclipse.dsl.tests .............. SUCCESS [  1.581 s]
09-Dec-2019 00:06:22 [INFO] org.codehaus.groovy.eclipse.junit.test ............. SUCCESS [  1.156 s]
09-Dec-2019 00:06:22 [INFO] org.codehaus.groovy.eclipse.refactoring.test ....... SUCCESS [  2.273 s]
09-Dec-2019 00:06:22 [INFO] org.codehaus.groovy.eclipse.quickfix.test .......... SUCCESS [  1.380 s]
09-Dec-2019 00:06:22 [INFO] org.codehaus.groovy.alltests ....................... SUCCESS [  01:32 h]
09-Dec-2019 00:06:22 [INFO] org.codehaus.groovy.m2eclipse ...................... SUCCESS [  0.929 s]
09-Dec-2019 00:06:22 [INFO] org.codehaus.groovy.m2eclipse.feature .............. SUCCESS [  0.468 s]
09-Dec-2019 00:06:22 [INFO] org.codehaus.groovy.eclipse.site 3.6.0-SNAPSHOT .... SUCCESS [ 34.695 s]
09-Dec-2019 00:06:22 [INFO] ------------------------------------------------------------------------
09-Dec-2019 00:06:22 [INFO] BUILD SUCCESS
09-Dec-2019 00:06:22 [INFO] ------------------------------------------------------------------------
09-Dec-2019 00:06:22 [INFO] Total time: 01:35 h
09-Dec-2019 00:06:22 [INFO] Finished at: 2019-12-09T00:06:22Z
09-Dec-2019 00:06:22 [INFO] ------------------------------------------------------------------------
09-Dec-2019 00:06:22 [WARNING] The requested profile "snapshot" could not be activated because it does not exist.
09-Dec-2019 00:06:23 Parsing test results under /opt/bamboo-home/xml-data/build-dir/GRECLIPSE-GE49-JOB1...
09-Dec-2019 00:06:23 Failing task since 4 failing test cases were found.
09-Dec-2019 00:06:23 Finished task 'Maven 3.x' with result: Failed
09-Dec-2019 00:06:23 Running post build plugin 'Docker Container Cleanup'
09-Dec-2019 00:06:23 Running post build plugin 'NCover Results Collector'
09-Dec-2019 00:06:23 Running post build plugin 'Artifactory Release Management Staging'
09-Dec-2019 00:06:23 Running post build plugin 'Artifactory Build Info Copier'
09-Dec-2019 00:06:23 Running post build plugin 'Artifactory Gradle Properties Info Copier'
09-Dec-2019 00:06:23 Running post build plugin 'Clover Results Collector'
09-Dec-2019 00:06:23 Running post build plugin 'npm Cache Cleanup'
09-Dec-2019 00:06:23 Running post build plugin 'Artifact Copier'
09-Dec-2019 00:06:23 Publishing an artifact: Zipped Update Site
09-Dec-2019 00:06:23 Finished publishing of artifact Non required job artifact: [Zipped Update Site], pattern: [**/*updatesite.zip] anchored at: [Site-org.codehaus.groovy.eclipse/target/site] in 11.89 ms
09-Dec-2019 00:06:23 Publishing an artifact: surefire-reports
09-Dec-2019 00:06:24 Finished publishing of artifact Non required job artifact: [surefire-reports], pattern: [**/target/TEST-*.xml] in 658.4 ms
09-Dec-2019 00:06:25 Successfully removed working directory at '/opt/bamboo-home/xml-data/build-dir/GRECLIPSE-GE49-JOB1'
09-Dec-2019 00:06:25 Finalising the build...
09-Dec-2019 00:06:25 Stopping timer.
09-Dec-2019 00:06:25 Build GRECLIPSE-GE49-JOB1-531 completed.
09-Dec-2019 00:06:25 Running on server: post build plugin 'NCover Results Collector'
09-Dec-2019 00:06:25 Running on server: post build plugin 'Build Hanging Detection Configuration'
09-Dec-2019 00:06:25 Running on server: post build plugin 'Bamboo project link creator'
09-Dec-2019 00:06:25 Running on server: post build plugin 'Clover Delta Calculator'
09-Dec-2019 00:06:25 Running on server: post build plugin 'Maven Dependencies Postprocessor'
09-Dec-2019 00:06:25 All post build plugins have finished
09-Dec-2019 00:06:25 Generating build results summary...
09-Dec-2019 00:06:26 Saving build results to disk...
09-Dec-2019 00:06:26 Logging substituted variables...
09-Dec-2019 00:06:26 Indexing build results...
09-Dec-2019 00:06:26 Finished building GRECLIPSE-GE49-JOB1-531.