Build: #531 failed

Job: Default Job failed

Stages & jobs

  1. Default Stage

Test results

  • 6,189 tests in total
  • 4 tests failed
  • 2 failures are new
  • 10 tests were fixed
  • 119 tests were quarantined / skipped
  • 90 minutes taken in total.

Build 531 has the following 4 errors: 2 new failure(s) occurred since the previous build.

New test failures 2
Status Test Duration
Collapse Failed BasicGroovyBuildTests testProjectBasedirAsOutputLocation History
< 1 sec
org.junit.ComparisonFailure: unexpected recompiled units. lenExpected=1 lenActual=2 expected:<{p.Script[]}> but was:<{p.Script[,p.Script]}>
	at org.eclipse.jdt.core.groovy.tests.builder.BasicGroovyBuildTests.testProjectBasedirAsOutputLocation(BasicGroovyBuildTests.java:274)
Collapse Failed ConstructorReferenceSearchTests testConstructorReferences3 History
< 1 sec
java.lang.AssertionError: expected:<3> but was:<0>
	at org.eclipse.jdt.core.groovy.tests.search.ConstructorReferenceSearchTests.testConstructorReferences3(ConstructorReferenceSearchTests.java:126)
Existing test failures 2
Status Test Failing since Duration
junit.framework.ComparisonFailure: 
----------- Expected ------------

------------ but was ------------
Problem : The import util.MyException is never used [ resource : </Project/src/p/Test.java> range : <18,34> category : <120> severity : <1>]

--------- Difference is ----------
 expected:<[]> but was:<[Problem : The import util.MyException is never used [ resource : </Project/src/p/Test.java> range : <18,34> category : <120> severity : <1>]
(12 more lines...)
java.lang.AssertionError: Expected but not found: SongTests (not open) [in SongTests.groovy [in gtunes [in src [in Project]]]]
Expected but not found: ArtistTests (not open) [in ArtistTests.groovy [in gtunes [in src [in Project]]]]
Found but not expected: class ArtistTests [in ArtistTests.groovy [in src.gtunes [in <project root> [in Project]]]]
  java.lang.Object testSomething()
Found but not expected: class SongTests [in SongTests.groovy [in src.gtunes [in <project root> [in Project]]]]
  java.lang.Object testSomething()

java.lang.AssertionError: 
(9 more lines...)