Build: #533 failed

Job: Default Job failed

Stages & jobs

  1. Default Stage

Job result summary

Completed
Duration
94 minutes
Agent
bamboo-19.af.pivotal.io
Revision
1427ff22b237d4cfb9a5819bd42dfc9dbffc9b17 1427ff22b237d4cfb9a5819bd42dfc9dbffc9b17
Total tests
6189
Failing since
#529 (Code changes detected – )
Fixed in
#577 (Code changes detected)

Tests

  • 6,189 tests in total
  • 21 tests failed
  • 20 failures are new
  • 119 tests were quarantined / skipped
  • 90 minutes taken in total.
New test failures 20
Status Test Duration
Collapse Failed SyntheticMemberSearchTests testSearchInGroovy1 History
1 sec
java.lang.AssertionError: Wrong number of matches found in:
 expected:<3> but was:<0>
java.lang.AssertionError: 
Wrong number of matches found in:
 expected:<3> but was:<0>
	at org.codehaus.groovy.eclipse.core.test.SyntheticMemberSearchTests.assertCount(SyntheticMemberSearchTests.groovy:259)
	at org.codehaus.groovy.eclipse.core.test.SyntheticMemberSearchTests.testSearchInGroovy1(SyntheticMemberSearchTests.groovy:57)
Collapse Failed SyntheticMemberSearchTests testSearchInGroovy5 History
1 sec
java.lang.AssertionError: Wrong number of matches found in:
 expected:<1> but was:<0>
java.lang.AssertionError: 
Wrong number of matches found in:
 expected:<1> but was:<0>
	at org.codehaus.groovy.eclipse.core.test.SyntheticMemberSearchTests.assertCount(SyntheticMemberSearchTests.groovy:259)
	at org.codehaus.groovy.eclipse.core.test.SyntheticMemberSearchTests.testSearchInGroovy5(SyntheticMemberSearchTests.groovy:129)
Collapse Failed SyntheticMemberSearchTests testSearchInJava1 History
5 secs
java.lang.AssertionError: Wrong number of matches found in:
 expected:<3> but was:<0>
java.lang.AssertionError: 
Wrong number of matches found in:
 expected:<3> but was:<0>
	at org.codehaus.groovy.eclipse.core.test.SyntheticMemberSearchTests.assertCount(SyntheticMemberSearchTests.groovy:259)
	at org.codehaus.groovy.eclipse.core.test.SyntheticMemberSearchTests.testSearchInJava1(SyntheticMemberSearchTests.groovy:173)
Collapse Failed SyntheticMemberSearchTests testSearchInJava2 History
1 sec
java.lang.AssertionError: Wrong number of matches found in:
 expected:<1> but was:<0>
java.lang.AssertionError: 
Wrong number of matches found in:
 expected:<1> but was:<0>
	at org.codehaus.groovy.eclipse.core.test.SyntheticMemberSearchTests.assertCount(SyntheticMemberSearchTests.groovy:259)
	at org.codehaus.groovy.eclipse.core.test.SyntheticMemberSearchTests.testSearchInJava2(SyntheticMemberSearchTests.groovy:195)
Collapse Failed SyntheticMemberSearchTests testSearchInJava3 History
1 sec
java.lang.AssertionError: Wrong number of matches found in:
 expected:<1> but was:<0>
java.lang.AssertionError: 
Wrong number of matches found in:
 expected:<1> but was:<0>
	at org.codehaus.groovy.eclipse.core.test.SyntheticMemberSearchTests.assertCount(SyntheticMemberSearchTests.groovy:259)
	at org.codehaus.groovy.eclipse.core.test.SyntheticMemberSearchTests.testSearchInJava3(SyntheticMemberSearchTests.groovy:217)
Collapse Failed SyntheticMemberSearchTests testSearchInJava4 History
1 sec
java.lang.AssertionError: Wrong number of matches found in:
 expected:<1> but was:<0>
java.lang.AssertionError: 
Wrong number of matches found in:
 expected:<1> but was:<0>
	at org.codehaus.groovy.eclipse.core.test.SyntheticMemberSearchTests.assertCount(SyntheticMemberSearchTests.groovy:259)
	at org.codehaus.groovy.eclipse.core.test.SyntheticMemberSearchTests.testSearchInJava4(SyntheticMemberSearchTests.groovy:239)
Collapse Failed MoveCURefactoringTests testMoveBack History
1 sec
org.junit.ComparisonFailure: Refactoring produced unexpected results: expected:<package p2
[]
public class Groovy...> but was:<package p2
[import p1.Groovy
]
public class Groovy...>
org.junit.ComparisonFailure: 
Refactoring produced unexpected results: expected:<package p2
(7 more lines...)
Collapse Failed MoveCURefactoringTests testNonPrimaryMove History
1 sec
org.junit.ComparisonFailure: Refactoring produced unexpected results: expected:<package p2
import [NEW].Groovy
public class...> but was:<package p2
import [p1].Groovy
public class...>
org.junit.ComparisonFailure: 
Refactoring produced unexpected results: expected:<package p2
import [NEW].Groovy
(5 more lines...)
Collapse Failed MoveCURefactoringTests testNonPrimaryQualifiedMove History
1 sec
org.junit.ComparisonFailure: Refactoring produced unexpected results: expected:<...ass Groovy2 extends [NEW].Groovy { }> but was:<...ass Groovy2 extends [p1].Groovy { }>
	at org.codehaus.groovy.eclipse.refactoring.test.rename.MoveCURefactoringTests.performRefactoringAndUndo(MoveCURefactoringTests.groovy:67)
	at org.codehaus.groovy.eclipse.refactoring.test.rename.MoveCURefactoringTests.testNonPrimaryQualifiedMove(MoveCURefactoringTests.groovy:235)
Collapse Failed MoveCURefactoringTests testQualifiedMove1 History
1 sec
org.junit.ComparisonFailure: Refactoring produced unexpected results: expected:<...lass Groovy extends [NEW].Java { }> but was:<...lass Groovy extends [p].Java { }>
	at org.codehaus.groovy.eclipse.refactoring.test.rename.MoveCURefactoringTests.performRefactoringAndUndo(MoveCURefactoringTests.groovy:67)
	at org.codehaus.groovy.eclipse.refactoring.test.rename.MoveCURefactoringTests.testQualifiedMove1(MoveCURefactoringTests.groovy:144)
Collapse Failed MoveCURefactoringTests testQualifiedMove2 History
1 sec
org.junit.ComparisonFailure: Refactoring produced unexpected results: expected:<...ass Groovy2 extends [NEW].Groovy { }> but was:<...ass Groovy2 extends [p1].Groovy { }>
	at org.codehaus.groovy.eclipse.refactoring.test.rename.MoveCURefactoringTests.performRefactoringAndUndo(MoveCURefactoringTests.groovy:67)
	at org.codehaus.groovy.eclipse.refactoring.test.rename.MoveCURefactoringTests.testQualifiedMove2(MoveCURefactoringTests.groovy:157)
Collapse Failed MoveCURefactoringTests testQualifiedMove3 History
1 sec
org.junit.ComparisonFailure: Refactoring produced unexpected results: expected:<... g1

import static j[2.Java.*
import j2.Java

class Groovy {
  def m1() {
    Java j = new j2].Java()
(33 more lines...)
Collapse Failed MoveCURefactoringTests testSimpleMove3 History
< 1 sec
org.junit.ComparisonFailure: Refactoring produced unexpected results: expected:<package p;
[
import NEW.Java

]public class Groovy ...> but was:<package p;
[]public class Groovy ...>
org.junit.ComparisonFailure: 
Refactoring produced unexpected results: expected:<package p;
(7 more lines...)
Collapse Failed MoveCURefactoringTests testSimpleMove4 History
< 1 sec
org.junit.ComparisonFailure: Refactoring produced unexpected results: expected:<package p2
import [NEW].Groovy
public class...> but was:<package p2
import [p1].Groovy
public class...>
org.junit.ComparisonFailure: 
Refactoring produced unexpected results: expected:<package p2
import [NEW].Groovy
(5 more lines...)
Collapse Failed BasicGroovyBuildTests testBuildGroovyHelloWorld History
< 1 sec
org.junit.ComparisonFailure: unexpected recompiled units. lenExpected=1 lenActual=2 expected:<{p1.Hello[]}> but was:<{p1.Hello[,p1.Hello]}>
	at org.eclipse.jdt.core.groovy.tests.builder.BasicGroovyBuildTests.testBuildGroovyHelloWorld(BasicGroovyBuildTests.java:195)
Collapse Failed ScriptFolderTests testScriptInProjectDisabled History
< 1 sec
java.lang.AssertionError: File should exist: L/Project/bin/Script.class
	at org.eclipse.jdt.core.groovy.tests.builder.ScriptFolderTests.assertExists(ScriptFolderTests.java:430)
	at org.eclipse.jdt.core.groovy.tests.builder.ScriptFolderTests.testScriptInProjectDisabled(ScriptFolderTests.java:143)
Collapse Failed BinarySearchTests testMethodDecl History
< 1 sec
java.lang.AssertionError: Expecting 4 matches, but found 0

java.lang.AssertionError: 
Expecting 4 matches, but found 0

	at org.eclipse.jdt.core.groovy.tests.search.BinarySearchTests.assertMatches(BinarySearchTests.java:139)
	at org.eclipse.jdt.core.groovy.tests.search.BinarySearchTests.testMethodDecl(BinarySearchTests.java:199)
Collapse Failed ConstructorReferenceSearchTests testConstructorReferences5 History
< 1 sec
java.lang.AssertionError: expected:<1> but was:<0>
	at org.eclipse.jdt.core.groovy.tests.search.ConstructorReferenceSearchTests.testConstructorReferences5(ConstructorReferenceSearchTests.java:162)
Collapse Failed ConstructorReferenceSearchTests testConstructorReferences7 History
< 1 sec
java.lang.AssertionError: expected:<1> but was:<0>
	at org.eclipse.jdt.core.groovy.tests.search.ConstructorReferenceSearchTests.testConstructorReferences7(ConstructorReferenceSearchTests.java:198)
Collapse Failed DGMInferencingTests testDGM20 History
< 1 sec
java.lang.AssertionError: Expected type not found.
Expected: java.lang.String
Found: java.lang.Object
Declaring type: Search
ASTNode: org.codehaus.groovy.ast.expr.VariableExpression@f0804[variable: key]
Confidence: INFERRED

java.lang.AssertionError: 
(9 more lines...)
Existing test failures 1
Status Test Failing since Duration
junit.framework.ComparisonFailure: 
----------- Expected ------------

------------ but was ------------
Problem : The import util.MyException is never used [ resource : </Project/src/p/Test.java> range : <18,34> category : <120> severity : <1>]

--------- Difference is ----------
 expected:<[]> but was:<[Problem : The import util.MyException is never used [ resource : </Project/src/p/Test.java> range : <18,34> category : <120> severity : <1>]
(12 more lines...)

Error summary

The build generated some errors. See the full build log for more details.

Dec 09, 2019 5:05:12 PM org.apache.http.impl.execchain.RetryExec execute
INFO: I/O exception (org.apache.http.NoHttpResponseException) caught when processing request to {s}->https://download.eclipse.org:443: The target server failed to respond
Dec 09, 2019 5:05:12 PM org.apache.http.impl.execchain.RetryExec execute
INFO: Retrying request to {s}->https://download.eclipse.org:443

(SWT:24205): Gtk-WARNING **: 17:06:36.468: gtk_widget_size_allocate(): attempt to allocate widget with width -3 and height -3

(SWT:24205): Gtk-CRITICAL **: 17:06:39.401: gtk_box_gadget_distribute: assertion 'size >= 0' failed in GtkScrollbar
TypeInferencingVisitorWithRequestor.findMethodNode: no match found for Main.main([Qjava.lang.String;)
TypeInferencingVisitorWithRequestor.findMethodNode: no match found for Main.main([Qjava.lang.String;)
CodeSelectRequestor: Could not proceed due to null declaring type for org.codehaus.groovy.ast.expr.BinaryExpression@ecbea[org.codehaus.groovy.ast.expr.VariableExpression@ecbe3[variable: it]("in" at 1:20:  "in" )org.codehaus.groovy.ast.expr.ListExpression@ee270[]]
CodeSelectRequestor: Could not proceed due to null declaring type for org.codehaus.groovy.ast.expr.RangeExpression@ebcdd
CodeSelectRequestor: Could not proceed due to null declaring type for org.codehaus.groovy.ast.expr.RangeExpression@ebcde
TypeInferencingVisitorWithRequestor.findMethodNode: no match found for Type.x(QList<Qjava.util.Date;>;)
TypeInferencingVisitorWithRequestor.findMethodNode: no match found for Type.x(QList<Qjava.lang.Number;>;)
TypeInferencingVisitorWithRequestor.findMethodNode: no match found for Type.x(QList<Qjava.lang.Number;>;)
TypeInferencingVisitorWithRequestor.findMethodNode: no match found for Type.x(QList<Qjava.util.Date;>;)
TypeInferencingVisitorWithRequestor.findMethodNode: no match found for Type.x(QList<Qjava.lang.Number;>;)
TypeInferencingVisitorWithRequestor.findMethodNode: no match found for Type.x(QList<Qjava.lang.Number;>;)
CodeSelectRequestor: Could not proceed due to null declaring type for org.codehaus.groovy.ast.expr.ConstantExpression@e8fc6[fff]
CodeSelectRequestor: Could not proceed due to null declaring type for org.codehaus.groovy.ast.expr.ConstantExpression@e8fca[fff]
CodeSelectRequestor: Could not proceed due to null declaring type for org.codehaus.groovy.ast.expr.ConstantExpression@e8fca[fff]
Waiting for: Java indexing... 3 files to index (/Project)
Waiting for: Java indexing... 22 files to index (/Project)
Waiting for: Java indexing... 22 files to index (/Project)
Waiting for: Java indexing... 22 files to index (/Project)
Waiting for: Java indexing... 4 files to index (/opt/bamboo-home/xml-data/build-dir/GRECLIPSE-GE49-JOB1/ide-test/org.codehaus.groovy.alltests/target/work/plugins/org.eclipse.jdt.groovy.core.tests.builder_3.6.0.v201912091705-e1809/lib/binGroovySearch.jar)
Waiting for: Java indexing... 22 files to index (/Project)
Waiting for: Java indexing... 22 files to index (/Project)
Waiting for: Java indexing... 4 files to index (/Project)
Waiting for: Java indexing... 21 files to index (/Project)
Waiting for: Java indexing... 21 files to index (/Project)
Waiting for: Java indexing... 18 files to index (/opt/jdk8u232-b09/jre/lib/rt.jar)