Build: #539 failed

Job: Default Job failed

Stages & jobs

  1. Default Stage

Job result summary

Completed
Duration
95 minutes
Agent
bamboo-24.af.pivotal.io
Revision
b35a6598f61560af82b109832dc5d6f66de71b8f b35a6598f61560af82b109832dc5d6f66de71b8f
Total tests
6212
Failing since
#529 (Code changes detected – )
Fixed in
#577 (Code changes detected)

Tests

  • 6,212 tests in total
  • 4 tests failed
  • 3 failures are new
  • 1 test was fixed
  • 126 tests were quarantined / skipped
  • 90 minutes taken in total.
New test failures 3
Status Test Duration
Collapse Failed BasicGroovyBuildTests testTags4 History
< 1 sec
java.lang.AssertionError: Wrong size expected:<2> but was:<0>
	at org.eclipse.jdt.core.groovy.tests.builder.BasicGroovyBuildTests.testTags4(BasicGroovyBuildTests.java:3388)
Collapse Failed DGMInferencingTests testDGMDeclaring3 History
< 1 sec
java.lang.AssertionError: Expected declaring type not found.
 Expected: org.codehaus.groovy.runtime.IOGroovyMethods
 Found type: java.lang.String
 Found declaring type: java.io.Writer
 ASTNode: org.codehaus.groovy.ast.expr.ConstantExpression@f0bcc[leftShift]
java.lang.AssertionError: 
Expected declaring type not found.
	Expected: org.codehaus.groovy.runtime.IOGroovyMethods
(5 more lines...)
Collapse Failed DGMInferencingTests testStaticMixinDGM History
< 1 sec
java.lang.AssertionError: Expected declaring type not found.
 Expected: org.codehaus.groovy.runtime.DefaultGroovyMethods
 Found type: java.lang.String
 Found declaring type: java.lang.String
 ASTNode: org.codehaus.groovy.ast.expr.ConstantExpression@10f08a[mixin]
java.lang.AssertionError: 
Expected declaring type not found.
	Expected: org.codehaus.groovy.runtime.DefaultGroovyMethods
(5 more lines...)
Existing test failures 1
Status Test Failing since Duration
junit.framework.ComparisonFailure: 
----------- Expected ------------

------------ but was ------------
Problem : The import util.MyException is never used [ resource : </Project/src/p/Test.java> range : <18,34> category : <120> severity : <1>]

--------- Difference is ----------
 expected:<[]> but was:<[Problem : The import util.MyException is never used [ resource : </Project/src/p/Test.java> range : <18,34> category : <120> severity : <1>]
(12 more lines...)
Fixed tests 1
Status Test Failing since Duration
Successful BasicGroovyBuildTests testTraitBinary History
Failing since build #538 (Code changes detected) 2 secs

Error summary

The build generated some errors. See the full build log for more details.

Dec 12, 2019 6:42:52 PM org.apache.http.impl.execchain.RetryExec execute
INFO: I/O exception (org.apache.http.NoHttpResponseException) caught when processing request to {s}->https://download.eclipse.org:443: The target server failed to respond
Dec 12, 2019 6:42:52 PM org.apache.http.impl.execchain.RetryExec execute
INFO: Retrying request to {s}->https://download.eclipse.org:443

(SWT:2287): Gtk-WARNING **: 18:44:12.327: gtk_widget_size_allocate(): attempt to allocate widget with width -3 and height -3

(SWT:2287): Gtk-CRITICAL **: 18:44:14.945: gtk_box_gadget_distribute: assertion 'size >= 0' failed in GtkScrollbar
TypeInferencingVisitorWithRequestor.findMethodNode: no match found for Main.main([Qjava.lang.String;)
TypeInferencingVisitorWithRequestor.findMethodNode: no match found for Main.main([Qjava.lang.String;)
CodeSelectRequestor: Could not proceed due to null declaring type for org.codehaus.groovy.ast.expr.BinaryExpression@ecbea[org.codehaus.groovy.ast.expr.VariableExpression@ecbe3[variable: it]("in" at 1:20:  "in" )org.codehaus.groovy.ast.expr.ListExpression@ee270[]]
CodeSelectRequestor: Could not proceed due to null declaring type for org.codehaus.groovy.ast.expr.RangeExpression@ebcdd
CodeSelectRequestor: Could not proceed due to null declaring type for org.codehaus.groovy.ast.expr.RangeExpression@ebcde
TypeInferencingVisitorWithRequestor.findMethodNode: no match found for Type.x(QList<Qjava.util.Date;>;)
TypeInferencingVisitorWithRequestor.findMethodNode: no match found for Type.x(QList<Qjava.lang.Number;>;)
TypeInferencingVisitorWithRequestor.findMethodNode: no match found for Type.x(QList<Qjava.util.Date;>;)
TypeInferencingVisitorWithRequestor.findMethodNode: no match found for Type.x(QList<Qjava.lang.Number;>;)
TypeInferencingVisitorWithRequestor.findMethodNode: no match found for Type.x(QList<Qjava.lang.Number;>;)
CodeSelectRequestor: Could not proceed due to null declaring type for org.codehaus.groovy.ast.expr.ConstantExpression@e8fc6[fff]
CodeSelectRequestor: Could not proceed due to null declaring type for org.codehaus.groovy.ast.expr.ConstantExpression@e8fca[fff]
CodeSelectRequestor: Could not proceed due to null declaring type for org.codehaus.groovy.ast.expr.ConstantExpression@e8fca[fff]
Waiting for: Java indexing... 18 files to index (/opt/jdk8u232-b09/jre/lib/rt.jar)
Waiting for: Java indexing... 22 files to index (/Project)
Waiting for: Java indexing... 22 files to index (/Project)
Waiting for: Java indexing... 22 files to index (/Project)
Waiting for: Java indexing... 22 files to index (/Project)
Waiting for: Java indexing... 22 files to index (/Project)
Waiting for: Java indexing... 22 files to index (/Project)
Waiting for: Java indexing... 21 files to index (/Project)
Waiting for: Java indexing... 2 files to index (/Project)
Waiting for: Java indexing... 3 files to index (/Project)
Waiting for: Flushing content description cache.
Waiting for: Java indexing... 16 files to index (/opt/jdk8u232-b09/jre/lib/rt.jar)