Build: #539 failed

Job: Default Job failed

Stages & jobs

  1. Default Stage

Test results

  • 6,212 tests in total
  • 4 tests failed
  • 3 failures are new
  • 1 test was fixed
  • 126 tests were quarantined / skipped
  • 90 minutes taken in total.

Build 539 has the following 4 errors: 3 new failure(s) occurred since the previous build.

New test failures 3
Status Test Duration
Collapse Failed BasicGroovyBuildTests testTags4 History
< 1 sec
java.lang.AssertionError: Wrong size expected:<2> but was:<0>
	at org.eclipse.jdt.core.groovy.tests.builder.BasicGroovyBuildTests.testTags4(BasicGroovyBuildTests.java:3388)
Collapse Failed DGMInferencingTests testDGMDeclaring3 History
< 1 sec
java.lang.AssertionError: Expected declaring type not found.
 Expected: org.codehaus.groovy.runtime.IOGroovyMethods
 Found type: java.lang.String
 Found declaring type: java.io.Writer
 ASTNode: org.codehaus.groovy.ast.expr.ConstantExpression@f0bcc[leftShift]
java.lang.AssertionError: 
Expected declaring type not found.
	Expected: org.codehaus.groovy.runtime.IOGroovyMethods
(5 more lines...)
Collapse Failed DGMInferencingTests testStaticMixinDGM History
< 1 sec
java.lang.AssertionError: Expected declaring type not found.
 Expected: org.codehaus.groovy.runtime.DefaultGroovyMethods
 Found type: java.lang.String
 Found declaring type: java.lang.String
 ASTNode: org.codehaus.groovy.ast.expr.ConstantExpression@10f08a[mixin]
java.lang.AssertionError: 
Expected declaring type not found.
	Expected: org.codehaus.groovy.runtime.DefaultGroovyMethods
(5 more lines...)
Existing test failures 1
Status Test Failing since Duration
junit.framework.ComparisonFailure: 
----------- Expected ------------

------------ but was ------------
Problem : The import util.MyException is never used [ resource : </Project/src/p/Test.java> range : <18,34> category : <120> severity : <1>]

--------- Difference is ----------
 expected:<[]> but was:<[Problem : The import util.MyException is never used [ resource : </Project/src/p/Test.java> range : <18,34> category : <120> severity : <1>]
(12 more lines...)