Build: #542 failed

Job: Default Job failed

Stages & jobs

  1. Default Stage

Test results

  • 6,220 tests in total
  • 4 tests failed
  • 3 failures are new
  • 1 test was fixed
  • 126 tests were quarantined / skipped
  • 91 minutes taken in total.

Build 542 has the following 4 errors: 3 new failure(s) occurred since the previous build.

New test failures 3
Status Test Duration
Collapse Failed DGMInferencingTests testDGM19 History
< 1 sec
java.lang.AssertionError: Expected type not found.
Expected: java.lang.Integer
Found: java.lang.Object
Declaring type: Search
ASTNode: org.codehaus.groovy.ast.expr.VariableExpression@f532e[variable: value]
Confidence: INFERRED

java.lang.AssertionError: 
(9 more lines...)
Collapse Failed DGMInferencingTests testDGM2a History
< 1 sec
java.lang.AssertionError: Expected type not found.
Expected: java.lang.String
Found: java.lang.Number
Declaring type: Z
ASTNode: org.codehaus.groovy.ast.expr.VariableExpression@11bb76[variable: value type: java.lang.Number -> java.lang.Number]
Confidence: EXACT

java.lang.AssertionError: 
(9 more lines...)
Collapse Failed DGMInferencingTests testDGSMDeclaring3 History
< 1 sec
java.lang.AssertionError: Expected declaring type not found.
 Expected: org.codehaus.groovy.runtime.DefaultGroovyStaticMethods
 Found type: java.lang.Object
 Found declaring type: Search
 ASTNode: org.codehaus.groovy.ast.expr.ConstantExpression@e8fc6[sleep]
java.lang.AssertionError: 
Expected declaring type not found.
	Expected: org.codehaus.groovy.runtime.DefaultGroovyStaticMethods
(5 more lines...)
Existing test failures 1
Status Test Failing since Duration
junit.framework.ComparisonFailure: 
----------- Expected ------------

------------ but was ------------
Problem : The import util.MyException is never used [ resource : </Project/src/p/Test.java> range : <18,34> category : <120> severity : <1>]

--------- Difference is ----------
 expected:<[]> but was:<[Problem : The import util.MyException is never used [ resource : </Project/src/p/Test.java> range : <18,34> category : <120> severity : <1>]
(12 more lines...)