Build: #552 failed

Job: Default Job failed

Stages & jobs

  1. Default Stage

Job result summary

Completed
Duration
97 minutes
Agent
bamboo-18.af.pivotal.io
Revision
ebfd4b4b18d4ed711fd7e1ebcd6b5b34ee1ac9fd ebfd4b4b18d4ed711fd7e1ebcd6b5b34ee1ac9fd
Total tests
6265
Failing since
#529 (Code changes detected – )

Tests

  • 6,265 tests in total
  • 3 tests failed
  • 2 failures are new
  • 3 tests were fixed
  • 143 tests were quarantined / skipped
  • 92 minutes taken in total.
New test failures 2
Status Test Duration
Collapse Failed DGMInferencingTests testDGMDeclaring2 History
< 1 sec
java.lang.AssertionError: Expected declaring type not found.
 Expected: org.codehaus.groovy.runtime.ResourceGroovyMethods
 Found type: java.lang.String
 Found declaring type: java.io.File
 ASTNode: org.codehaus.groovy.ast.expr.ConstantExpression@eb91f[eachLine]
java.lang.AssertionError: 
Expected declaring type not found.
	Expected: org.codehaus.groovy.runtime.ResourceGroovyMethods
(5 more lines...)
Collapse Failed MethodReferenceSearchTests testExplicitPropertyGetterSearch1 History
< 1 sec
java.lang.AssertionError: expected:<8> but was:<0>
	at org.eclipse.jdt.core.groovy.tests.search.MethodReferenceSearchTests.testExplicitPropertyGetterSearch1(MethodReferenceSearchTests.java:480)
Existing test failures 1
Status Test Failing since Duration
junit.framework.ComparisonFailure: 
----------- Expected ------------

------------ but was ------------
Problem : The import util.MyException is never used [ resource : </Project/src/p/Test.java> range : <18,34> category : <120> severity : <1>]

--------- Difference is ----------
 expected:<[]> but was:<[Problem : The import util.MyException is never used [ resource : </Project/src/p/Test.java> range : <18,34> category : <120> severity : <1>]
(12 more lines...)
Fixed tests 3
Status Test Failing since Duration
Successful BasicGroovyBuildTests testBuildGroovyHelloWorld2 History
Failing since build #551 (Code changes detected) < 1 sec
Successful BasicGroovyBuildTests testInnerClasses_GRE339 History
Failing since build #551 (Code changes detected) < 1 sec
Successful ClosureInferencingTests testNestedClosure7 History
Failing since build #551 (Code changes detected) < 1 sec

Error summary

The build generated some errors. See the full build log for more details.


(SWT:24673): Gtk-CRITICAL **: 04:41:37.223: gtk_box_gadget_distribute: assertion 'size >= 0' failed in GtkScrollbar
TypeInferencingVisitorWithRequestor.findMethodNode: no match found for Main.main([Qjava.lang.String;)
TypeInferencingVisitorWithRequestor.findMethodNode: no match found for Main.main([Qjava.lang.String;)
CodeSelectRequestor: Could not proceed due to null declaring type for org.codehaus.groovy.ast.expr.BinaryExpression@ecbea[org.codehaus.groovy.ast.expr.VariableExpression@ecbe3[variable: it]("in" at 1:20:  "in" )org.codehaus.groovy.ast.expr.ListExpression@ee270[]]
CodeSelectRequestor: Could not proceed due to null declaring type for org.codehaus.groovy.ast.expr.RangeExpression@ebcdd
CodeSelectRequestor: Could not proceed due to null declaring type for org.codehaus.groovy.ast.expr.RangeExpression@ebcde
TypeInferencingVisitorWithRequestor.findMethodNode: no match found for Type.x(QList<Qjava.util.Date;>;)
TypeInferencingVisitorWithRequestor.findMethodNode: no match found for Type.x(QList<Qjava.lang.Number;>;)
TypeInferencingVisitorWithRequestor.findMethodNode: no match found for Type.x(QList<Qjava.util.Date;>;)
TypeInferencingVisitorWithRequestor.findMethodNode: no match found for Type.x(QList<Qjava.lang.Number;>;)
TypeInferencingVisitorWithRequestor.findMethodNode: no match found for Type.x(QList<Qjava.lang.Number;>;)
CodeSelectRequestor: Could not proceed due to null declaring type for org.codehaus.groovy.ast.expr.ConstantExpression@e8fc6[fff]
CodeSelectRequestor: Could not proceed due to null declaring type for org.codehaus.groovy.ast.expr.ConstantExpression@e8fca[fff]
CodeSelectRequestor: Could not proceed due to null declaring type for org.codehaus.groovy.ast.expr.ConstantExpression@e8fca[fff]
Waiting for: Java indexing... 22 files to index (/Project)
Waiting for: Java indexing... 22 files to index (/Project)
Waiting for: Java indexing... 22 files to index (/Project)
Waiting for: Java indexing... 22 files to index (/Project)
Waiting for: Java indexing... 22 files to index (/Project)
Waiting for: Java indexing... 22 files to index (/Project)
Waiting for: Java indexing... 22 files to index (/Project)
Waiting for: Java indexing... 3 files to index (/Project)
Waiting for: Java indexing... 21 files to index (/Project)
Waiting for: Flushing content description cache.
Waiting for: Java indexing... 7 files to index (/Project)
Waiting for: Java indexing... 3 files to index (/Project)