Build: #554 failed

Job: Default Job failed

Stages & jobs

  1. Default Stage

Job result summary

Completed
Duration
95 minutes
Agent
bamboo-21.af.pivotal.io
Revision
528225a1495e49b8cbf501b1805b9bb5f8edf4bc 528225a1495e49b8cbf501b1805b9bb5f8edf4bc
Total tests
6265
Failing since
#529 (Code changes detected – )

Tests

  • 6,265 tests in total
  • 4 tests failed
  • 3 failures are new
  • 2 tests were fixed
  • 143 tests were quarantined / skipped
  • 91 minutes taken in total.
New test failures 3
Status Test Duration
Collapse Failed BasicGroovyBuildTests testBuildGroovyHelloWorld History
< 1 sec
org.junit.ComparisonFailure: unexpected recompiled units. lenExpected=1 lenActual=2 expected:<{p1.Hello[]}> but was:<{p1.Hello[,p1.Hello]}>
	at org.eclipse.jdt.core.groovy.tests.builder.BasicGroovyBuildTests.testBuildGroovyHelloWorld(BasicGroovyBuildTests.java:195)
Collapse Failed ClosureInferencingTests testClosure11a History
< 1 sec
java.lang.AssertionError: Expected type not found.
Expected: java.lang.Class<Boo>
Found: java.lang.Class<Foo>
Declaring type: groovy.lang.Closure<V extends java.lang.Object>
ASTNode: org.codehaus.groovy.ast.expr.VariableExpression@10eccb[variable: delegate]
Confidence: INFERRED

java.lang.AssertionError: 
(8 more lines...)
Collapse Failed ClosureInferencingTests testClosure25 History
< 1 sec
java.lang.AssertionError: Expected type not found.
Expected: java.lang.Void
Found: java.lang.Long
Declaring type: Search
ASTNode: org.codehaus.groovy.ast.expr.VariableExpression@f0bc7[variable: time]
Confidence: INFERRED

java.lang.AssertionError: 
(8 more lines...)
Existing test failures 1
Status Test Failing since Duration
junit.framework.ComparisonFailure: 
----------- Expected ------------

------------ but was ------------
Problem : The import util.MyException is never used [ resource : </Project/src/p/Test.java> range : <18,34> category : <120> severity : <1>]

--------- Difference is ----------
 expected:<[]> but was:<[Problem : The import util.MyException is never used [ resource : </Project/src/p/Test.java> range : <18,34> category : <120> severity : <1>]
(12 more lines...)
Fixed tests 2
Status Test Failing since Duration
Successful DGMInferencingTests testDGMDeclaring2 History
Failing since build #552 (Code changes detected) < 1 sec
Successful MethodReferenceSearchTests testExplicitPropertyGetterSearch1 History
Failing since build #552 (Code changes detected) < 1 sec

Error summary

The build generated some errors. See the full build log for more details.

Dec 31, 2019 2:39:57 PM org.apache.http.impl.execchain.RetryExec execute
INFO: I/O exception (org.apache.http.NoHttpResponseException) caught when processing request to {s}->https://download.eclipse.org:443: The target server failed to respond
Dec 31, 2019 2:39:57 PM org.apache.http.impl.execchain.RetryExec execute
INFO: Retrying request to {s}->https://download.eclipse.org:443

(SWT:18859): Gtk-WARNING **: 14:41:19.781: gtk_widget_size_allocate(): attempt to allocate widget with width -3 and height -3

(SWT:18859): Gtk-CRITICAL **: 14:41:22.517: gtk_box_gadget_distribute: assertion 'size >= 0' failed in GtkScrollbar
TypeInferencingVisitorWithRequestor.findMethodNode: no match found for Main.main([Qjava.lang.String;)
TypeInferencingVisitorWithRequestor.findMethodNode: no match found for Main.main([Qjava.lang.String;)
CodeSelectRequestor: Could not proceed due to null declaring type for org.codehaus.groovy.ast.expr.BinaryExpression@ecbea[org.codehaus.groovy.ast.expr.VariableExpression@ecbe3[variable: it]("in" at 1:20:  "in" )org.codehaus.groovy.ast.expr.ListExpression@ee270[]]
CodeSelectRequestor: Could not proceed due to null declaring type for org.codehaus.groovy.ast.expr.RangeExpression@ebcdd
CodeSelectRequestor: Could not proceed due to null declaring type for org.codehaus.groovy.ast.expr.RangeExpression@ebcde
TypeInferencingVisitorWithRequestor.findMethodNode: no match found for Type.x(QList<Qjava.util.Date;>;)
TypeInferencingVisitorWithRequestor.findMethodNode: no match found for Type.x(QList<Qjava.lang.Number;>;)
TypeInferencingVisitorWithRequestor.findMethodNode: no match found for Type.x(QList<Qjava.util.Date;>;)
TypeInferencingVisitorWithRequestor.findMethodNode: no match found for Type.x(QList<Qjava.lang.Number;>;)
TypeInferencingVisitorWithRequestor.findMethodNode: no match found for Type.x(QList<Qjava.lang.Number;>;)
CodeSelectRequestor: Could not proceed due to null declaring type for org.codehaus.groovy.ast.expr.ConstantExpression@e8fc6[fff]
CodeSelectRequestor: Could not proceed due to null declaring type for org.codehaus.groovy.ast.expr.ConstantExpression@e8fca[fff]
CodeSelectRequestor: Could not proceed due to null declaring type for org.codehaus.groovy.ast.expr.ConstantExpression@e8fca[fff]
Waiting for: Java indexing... 22 files to index (/Project)
Waiting for: Java indexing... 22 files to index (/Project)
Waiting for: Java indexing... 22 files to index (/Project)
Waiting for: Java indexing... 22 files to index (/Project)
Waiting for: Java indexing... 22 files to index (/Project)
Waiting for: Java indexing... 22 files to index (/Project)
Waiting for: Java indexing... 22 files to index (/Project)
Waiting for: Java indexing... 3 files to index (/Project)
Waiting for: Java indexing... 21 files to index (/Project)
Waiting for: Java indexing... 21 files to index (/Project)
Waiting for: Flushing content description cache.
Waiting for: Java indexing... 18 files to index (/opt/jdk8u232-b09/jre/lib/rt.jar)