Build: #555 failed

Job: Default Job failed

Stages & jobs

  1. Default Stage

Job result summary

Completed
Duration
95 minutes
Agent
bamboo-23.af.pivotal.io
Revision
9103c8aa3ca9f1e1cf07de45387dea7f52c7129f 9103c8aa3ca9f1e1cf07de45387dea7f52c7129f
Total tests
6265
Failing since
#529 (Code changes detected – )

Tests

  • 6,265 tests in total
  • 6 tests failed
  • 5 failures are new
  • 3 tests were fixed
  • 143 tests were quarantined / skipped
  • 91 minutes taken in total.
New test failures 5
Status Test Duration
Collapse Failed BasicGroovyBuildTests testTags4 History
< 1 sec
java.lang.AssertionError: Wrong size expected:<2> but was:<0>
	at org.eclipse.jdt.core.groovy.tests.builder.BasicGroovyBuildTests.testTags4(BasicGroovyBuildTests.java:3388)
Collapse Failed ConstructorReferenceSearchTests testConstructorReferences12a History
< 1 sec
java.lang.AssertionError: expected:<3> but was:<0>
	at org.eclipse.jdt.core.groovy.tests.search.ConstructorReferenceSearchTests.testConstructorReferences12a(ConstructorReferenceSearchTests.java:332)
Collapse Failed DGMInferencingTests testDGMDeclaring6 History
< 1 sec
java.lang.AssertionError: Expected declaring type not found.
 Expected: org.codehaus.groovy.vmplugin.v8.PluginDefaultGroovyMethods
 Found type: java.lang.String
 Found declaring type: java.util.stream.Stream<java.lang.String>
 ASTNode: org.codehaus.groovy.ast.expr.ConstantExpression@ee635[toList]
java.lang.AssertionError: 
Expected declaring type not found.
	Expected: org.codehaus.groovy.vmplugin.v8.PluginDefaultGroovyMethods
(5 more lines...)
Collapse Failed InferencingTests testSpread15 History
< 1 sec
java.lang.AssertionError: Expected type not found.
Expected: java.util.List<java.lang.Object>
Found: java.util.List<java.lang.String>
Declaring type: Search
ASTNode: org.codehaus.groovy.ast.expr.VariableExpression@f87cb[variable: result]
Confidence: INFERRED

java.lang.AssertionError: 
(8 more lines...)
Collapse Failed OperatorOverloadingInferencingTests testCompleteExpr6 History
1 sec
java.lang.AssertionError: Expected type not found.
Expected: java.lang.String
Found: java.util.LinkedList<java.lang.String>
Declaring type: null
ASTNode: org.codehaus.groovy.ast.expr.BinaryExpression@e8fdc[org.codehaus.groovy.ast.expr.ConstructorCallExpression@e8fd9[type: java.util.LinkedList <String> -> java.util.LinkedList <E extends java.lang.Object> arguments: org.codehaus.groovy.ast.expr.ArgumentListExpression@ee62f[]]("[" at 1:25:  "[" )org.codehaus.groovy.ast.expr.ConstantExpression@eedb4[0]]
Confidence: EXACT

java.lang.AssertionError: 
(8 more lines...)
Existing test failures 1
Status Test Failing since Duration
junit.framework.ComparisonFailure: 
----------- Expected ------------

------------ but was ------------
Problem : The import util.MyException is never used [ resource : </Project/src/p/Test.java> range : <18,34> category : <120> severity : <1>]

--------- Difference is ----------
 expected:<[]> but was:<[Problem : The import util.MyException is never used [ resource : </Project/src/p/Test.java> range : <18,34> category : <120> severity : <1>]
(12 more lines...)
Fixed tests 3
Status Test Failing since Duration
Successful BasicGroovyBuildTests testBuildGroovyHelloWorld History
Failing since build #554 (Code changes detected) < 1 sec
Successful ClosureInferencingTests testClosure11a History
Failing since build #554 (Code changes detected) < 1 sec
Successful ClosureInferencingTests testClosure25 History
Failing since build #554 (Code changes detected) < 1 sec

Error summary

The build generated some errors. See the full build log for more details.


(SWT:29311): Gtk-WARNING **: 16:02:21.254: gtk_widget_size_allocate(): attempt to allocate widget with width -3 and height -3

(SWT:29311): Gtk-CRITICAL **: 16:02:23.862: gtk_box_gadget_distribute: assertion 'size >= 0' failed in GtkScrollbar
TypeInferencingVisitorWithRequestor.findMethodNode: no match found for Main.main([Qjava.lang.String;)
TypeInferencingVisitorWithRequestor.findMethodNode: no match found for Main.main([Qjava.lang.String;)
CodeSelectRequestor: Could not proceed due to null declaring type for org.codehaus.groovy.ast.expr.BinaryExpression@ecbea[org.codehaus.groovy.ast.expr.VariableExpression@ecbe3[variable: it]("in" at 1:20:  "in" )org.codehaus.groovy.ast.expr.ListExpression@ee270[]]
CodeSelectRequestor: Could not proceed due to null declaring type for org.codehaus.groovy.ast.expr.RangeExpression@ebcdd
CodeSelectRequestor: Could not proceed due to null declaring type for org.codehaus.groovy.ast.expr.RangeExpression@ebcde
TypeInferencingVisitorWithRequestor.findMethodNode: no match found for Type.x(QList<Qjava.util.Date;>;)
TypeInferencingVisitorWithRequestor.findMethodNode: no match found for Type.x(QList<Qjava.lang.Number;>;)
TypeInferencingVisitorWithRequestor.findMethodNode: no match found for Type.x(QList<Qjava.util.Date;>;)
TypeInferencingVisitorWithRequestor.findMethodNode: no match found for Type.x(QList<Qjava.lang.Number;>;)
CodeSelectRequestor: Could not proceed due to null declaring type for org.codehaus.groovy.ast.expr.ConstantExpression@e8fc6[fff]
CodeSelectRequestor: Could not proceed due to null declaring type for org.codehaus.groovy.ast.expr.ConstantExpression@e8fca[fff]
CodeSelectRequestor: Could not proceed due to null declaring type for org.codehaus.groovy.ast.expr.ConstantExpression@e8fca[fff]
Waiting for: Java indexing... 22 files to index (/Project)
Waiting for: Java indexing... 22 files to index (/Project)
Waiting for: Java indexing... 22 files to index (/Project)
Waiting for: Java indexing... 22 files to index (/Project)
Waiting for: Java indexing... 22 files to index (/Project)
Waiting for: Java indexing... 22 files to index (/Project)
Waiting for: Java indexing... 22 files to index (/Project)
Waiting for: Java indexing... 21 files to index (/Project)
Waiting for: Java indexing... 21 files to index (/Project)
Waiting for: Java indexing... 21 files to index (/Project)
Waiting for: Java indexing... 3 files to index (/Project)