Build: #557 failed

Job: Default Job failed

Stages & jobs

  1. Default Stage

Job result summary

Completed
Duration
96 minutes
Agent
bamboo-17.af.pivotal.io
Revision
f205fadccc3bf45419a13bcb36dc7c4269126975 f205fadccc3bf45419a13bcb36dc7c4269126975
Total tests
6267
Failing since
#529 (Code changes detected – )
Fixed in
#577 (Code changes detected)

Tests

  • 6,267 tests in total
  • 25 tests failed
  • 24 failures are new
  • 143 tests were quarantined / skipped
  • 92 minutes taken in total.
New test failures 24
Status Test Duration
Collapse Failed RenameMethodTests test1 History
1 sec
org.junit.ComparisonFailure: invalid renaming expected:<...(){
 }
 void f(){
  [k();
 }
 static int fred(){
  k();
  return 1;
(142 more lines...)
Collapse Failed RenameMethodTests test10 History
< 1 sec
org.eclipse.core.runtime.AssertionFailedException: assertion failed: Search for method declaration did not find original element: void setFoo(String) [in A [in A.groovy [in p [in src [in TestProject]]]]]
	at org.codehaus.groovy.eclipse.refactoring.test.rename.RenameMethodTests.runTest(RenameMethodTests.groovy:55)
	at org.codehaus.groovy.eclipse.refactoring.test.rename.RenameMethodTests.runTest(RenameMethodTests.groovy)
	at org.codehaus.groovy.eclipse.refactoring.test.rename.RenameMethodTests.test10(RenameMethodTests.groovy:120)
Collapse Failed RenameMethodTests test2 History
< 1 sec
org.eclipse.core.runtime.AssertionFailedException: assertion failed: Search for method declaration did not find original element: void m() [in A [in A.groovy [in p [in src [in TestProject]]]]]
	at org.codehaus.groovy.eclipse.refactoring.test.rename.RenameMethodTests.runTest(RenameMethodTests.groovy:55)
	at org.codehaus.groovy.eclipse.refactoring.test.rename.RenameMethodTests.runTest(RenameMethodTests.groovy)
	at org.codehaus.groovy.eclipse.refactoring.test.rename.RenameMethodTests.test2(RenameMethodTests.groovy:80)
Collapse Failed RenameMethodTests test3 History
1 sec
org.junit.ComparisonFailure: invalid renaming expected:<...      m
            [k()
            this.m
            this.k()
            new A().m
            new A().k()
            def x = new A()
            x.m
(38 more lines...)
Collapse Failed RenameMethodTests test4 History
< 1 sec
org.eclipse.core.runtime.AssertionFailedException: assertion failed: Search for method declaration did not find original element: void m() [in A [in A.groovy [in p [in src [in TestProject]]]]]
	at org.codehaus.groovy.eclipse.refactoring.test.rename.RenameMethodTests.runTest(RenameMethodTests.groovy:55)
	at org.codehaus.groovy.eclipse.refactoring.test.rename.RenameMethodTests.runTest(RenameMethodTests.groovy)
	at org.codehaus.groovy.eclipse.refactoring.test.rename.RenameMethodTests.test4(RenameMethodTests.groovy:90)
Collapse Failed RenameMethodTests test5 History
< 1 sec
org.eclipse.core.runtime.AssertionFailedException: assertion failed: Search for method declaration did not find original element: java.lang.Object m() [in A [in A.groovy [in p [in src [in TestProject]]]]]
	at org.codehaus.groovy.eclipse.refactoring.test.rename.RenameMethodTests.runTest(RenameMethodTests.groovy:55)
	at org.codehaus.groovy.eclipse.refactoring.test.rename.RenameMethodTests.runTest(RenameMethodTests.groovy)
	at org.codehaus.groovy.eclipse.refactoring.test.rename.RenameMethodTests.test5(RenameMethodTests.groovy:95)
Collapse Failed RenameMethodTests test6 History
< 1 sec
org.eclipse.core.runtime.AssertionFailedException: assertion failed: Search for method declaration did not find original element: java.lang.Object m() [in A [in A.groovy [in p [in src [in TestProject]]]]]
	at org.codehaus.groovy.eclipse.refactoring.test.rename.RenameMethodTests.runTest(RenameMethodTests.groovy:55)
	at org.codehaus.groovy.eclipse.refactoring.test.rename.RenameMethodTests.runTest(RenameMethodTests.groovy)
	at org.codehaus.groovy.eclipse.refactoring.test.rename.RenameMethodTests.test6(RenameMethodTests.groovy:100)
Collapse Failed RenameMethodTests test7 History
< 1 sec
org.eclipse.core.runtime.AssertionFailedException: assertion failed: Search for method declaration did not find original element: java.lang.Object m() [in A [in A.groovy [in p [in src [in TestProject]]]]]
	at org.codehaus.groovy.eclipse.refactoring.test.rename.RenameMethodTests.runTest(RenameMethodTests.groovy:55)
	at org.codehaus.groovy.eclipse.refactoring.test.rename.RenameMethodTests.runTest(RenameMethodTests.groovy)
	at org.codehaus.groovy.eclipse.refactoring.test.rename.RenameMethodTests.test7(RenameMethodTests.groovy:105)
Collapse Failed RenameMethodTests test8 History
< 1 sec
org.eclipse.core.runtime.AssertionFailedException: assertion failed: Search for method declaration did not find original element: java.lang.Object m() [in B [in A.groovy [in p [in src [in TestProject]]]]]
	at org.codehaus.groovy.eclipse.refactoring.test.rename.RenameMethodTests.runTest(RenameMethodTests.groovy:55)
	at org.codehaus.groovy.eclipse.refactoring.test.rename.RenameMethodTests.runTest(RenameMethodTests.groovy)
	at org.codehaus.groovy.eclipse.refactoring.test.rename.RenameMethodTests.test8(RenameMethodTests.groovy:110)
Collapse Failed RenameMethodTests test9 History
< 1 sec
org.eclipse.core.runtime.AssertionFailedException: assertion failed: Search for method declaration did not find original element: java.lang.Object m() [in A [in A.groovy [in p [in src [in TestProject]]]]]
	at org.codehaus.groovy.eclipse.refactoring.test.rename.RenameMethodTests.runTest(RenameMethodTests.groovy:55)
	at org.codehaus.groovy.eclipse.refactoring.test.rename.RenameMethodTests.runTest(RenameMethodTests.groovy)
	at org.codehaus.groovy.eclipse.refactoring.test.rename.RenameMethodTests.test9(RenameMethodTests.groovy:115)
Collapse Failed RenameMethodTests testAnonOverrides History
4 secs
org.eclipse.core.runtime.AssertionFailedException: assertion failed: Search for method declaration did not find original element: int run() [in I [in A.groovy [in p [in src [in TestProject]]]]]
	at org.codehaus.groovy.eclipse.refactoring.test.rename.RenameMethodTests.runTest(RenameMethodTests.groovy:55)
	at org.codehaus.groovy.eclipse.refactoring.test.rename.RenameMethodTests.runTest(RenameMethodTests.groovy)
	at org.codehaus.groovy.eclipse.refactoring.test.rename.RenameMethodTests.testAnonOverrides(RenameMethodTests.groovy:141)
Collapse Failed RenameMethodTests testEnumOverrides History
< 1 sec
org.eclipse.core.runtime.AssertionFailedException: assertion failed: Search for method declaration did not find original element: String getFoo() [in A [in A.groovy [in p [in src [in TestProject]]]]]
	at org.codehaus.groovy.eclipse.refactoring.test.rename.RenameMethodTests.runTest(RenameMethodTests.groovy:55)
	at org.codehaus.groovy.eclipse.refactoring.test.rename.RenameMethodTests.runTest(RenameMethodTests.groovy)
	at org.codehaus.groovy.eclipse.refactoring.test.rename.RenameMethodTests.testEnumOverrides(RenameMethodTests.groovy:147)
Collapse Failed RenameMethodTests testEnumOverrides2 History
< 1 sec
org.eclipse.core.runtime.AssertionFailedException: assertion failed: Search for method declaration did not find original element: String getFoo() [in A [in A.groovy [in p [in src [in TestProject]]]]]
	at org.codehaus.groovy.eclipse.refactoring.test.rename.RenameMethodTests.runTest(RenameMethodTests.groovy:55)
	at org.codehaus.groovy.eclipse.refactoring.test.rename.RenameMethodTests.runTest(RenameMethodTests.groovy)
	at org.codehaus.groovy.eclipse.refactoring.test.rename.RenameMethodTests.testEnumOverrides2(RenameMethodTests.groovy:153)
Collapse Failed RenameMethodTests testInitializer1 History
< 1 sec
org.eclipse.core.runtime.AssertionFailedException: assertion failed: Search for method declaration did not find original element: java.lang.Object m() [in A [in A.groovy [in p [in src [in TestProject]]]]]
	at org.codehaus.groovy.eclipse.refactoring.test.rename.RenameMethodTests.runTest(RenameMethodTests.groovy:55)
	at org.codehaus.groovy.eclipse.refactoring.test.rename.RenameMethodTests.runTest(RenameMethodTests.groovy)
	at org.codehaus.groovy.eclipse.refactoring.test.rename.RenameMethodTests.testInitializer1(RenameMethodTests.groovy:164)
Collapse Failed RenameMethodTests testInitializer2 History
< 1 sec
org.eclipse.core.runtime.AssertionFailedException: assertion failed: Search for method declaration did not find original element: java.lang.Object m() [in A [in A.groovy [in p [in src [in TestProject]]]]]
	at org.codehaus.groovy.eclipse.refactoring.test.rename.RenameMethodTests.runTest(RenameMethodTests.groovy:55)
	at org.codehaus.groovy.eclipse.refactoring.test.rename.RenameMethodTests.runTest(RenameMethodTests.groovy)
	at org.codehaus.groovy.eclipse.refactoring.test.rename.RenameMethodTests.testInitializer2(RenameMethodTests.groovy:169)
Collapse Failed RenameMethodTests testInitializer3 History
< 1 sec
org.eclipse.core.runtime.AssertionFailedException: assertion failed: Search for method declaration did not find original element: java.lang.Object m() [in A [in A.groovy [in p [in src [in TestProject]]]]]
	at org.codehaus.groovy.eclipse.refactoring.test.rename.RenameMethodTests.runTest(RenameMethodTests.groovy:55)
	at org.codehaus.groovy.eclipse.refactoring.test.rename.RenameMethodTests.runTest(RenameMethodTests.groovy)
	at org.codehaus.groovy.eclipse.refactoring.test.rename.RenameMethodTests.testInitializer3(RenameMethodTests.groovy:174)
Collapse Failed RenameMethodTests testOverload1 History
< 1 sec
org.eclipse.core.runtime.AssertionFailedException: assertion failed: Search for method declaration did not find original element: java.lang.Object m(java.lang.Object) [in I1 [in A.groovy [in p [in src [in TestProject]]]]]
	at org.codehaus.groovy.eclipse.refactoring.test.rename.RenameMethodTests.runTest(RenameMethodTests.groovy:55)
	at org.codehaus.groovy.eclipse.refactoring.test.rename.RenameMethodTests.runTest(RenameMethodTests.groovy)
	at org.codehaus.groovy.eclipse.refactoring.test.rename.RenameMethodTests.testOverload1(RenameMethodTests.groovy:193)
Collapse Failed RenameMethodTests testOverload2 History
< 1 sec
org.eclipse.core.runtime.AssertionFailedException: assertion failed: Search for method declaration did not find original element: java.lang.Object m(java.lang.Object) [in I2 [in A.groovy [in p [in src [in TestProject]]]]]
	at org.codehaus.groovy.eclipse.refactoring.test.rename.RenameMethodTests.runTest(RenameMethodTests.groovy:55)
	at org.codehaus.groovy.eclipse.refactoring.test.rename.RenameMethodTests.runTest(RenameMethodTests.groovy)
	at org.codehaus.groovy.eclipse.refactoring.test.rename.RenameMethodTests.testOverload2(RenameMethodTests.groovy:198)
Collapse Failed RenameMethodTests testOverload3 History
< 1 sec
org.eclipse.core.runtime.AssertionFailedException: assertion failed: Search for method declaration did not find original element: java.lang.Object m(java.lang.Object) [in I1 [in A.groovy [in p [in src [in TestProject]]]]]
	at org.codehaus.groovy.eclipse.refactoring.test.rename.RenameMethodTests.runTest(RenameMethodTests.groovy:55)
	at org.codehaus.groovy.eclipse.refactoring.test.rename.RenameMethodTests.runTest(RenameMethodTests.groovy)
	at org.codehaus.groovy.eclipse.refactoring.test.rename.RenameMethodTests.testOverload3(RenameMethodTests.groovy:203)
Collapse Failed RenameMethodTests testStaticImport History
1 sec
org.junit.ComparisonFailure: invalid renaming expected:<...port static o.Other.[BAR

FOO
BAR()
o.Other.FOO
o.Other.BAR]()
> but was:<...port static o.Other.[FOO

(22 more lines...)
Collapse Failed BasicGroovyBuildTests testTraitIncremental History
< 1 sec
org.junit.ComparisonFailure: unexpected recompiled units. lenExpected=4 lenActual=2 expected:<{Runner,[p.Named,p.Named$Trait$Helper,]q.NamedClass}> but was:<{Runner,[]q.NamedClass}>
	at org.eclipse.jdt.core.groovy.tests.builder.BasicGroovyBuildTests.testTraitIncremental(BasicGroovyBuildTests.java:2887)
Collapse Failed BuildAccessRulesTests testAccessForImport History
< 1 sec
junit.framework.ComparisonFailure: 
----------- Expected ------------
Problem : Access restriction: The type 'BeanDescriptor' is not API (restriction on required library '##') [ resource : </Project/src/Foo.groovy> range : <7,32> category : <150> severity : <2>]

------------ but was ------------

--------- Difference is ----------
 expected:<[Problem : Access restriction: The type 'BeanDescriptor' is not API (restriction on required library '##') [ resource : </Project/src/Foo.groovy> range : <7,32> category : <150> severity : <2>]
(13 more lines...)
Collapse Failed BinarySearchTests testMethodRefInInitializer History
1 sec
java.lang.AssertionError: Expecting 2 matches, but found 0

java.lang.AssertionError: 
Expecting 2 matches, but found 0

	at org.eclipse.jdt.core.groovy.tests.search.BinarySearchTests.assertMatches(BinarySearchTests.java:139)
	at org.eclipse.jdt.core.groovy.tests.search.BinarySearchTests.testMethodRefInInitializer(BinarySearchTests.java:217)
Collapse Failed ConstructorReferenceSearchTests testNewifyConstructorReferences2 History
< 1 sec
java.lang.AssertionError: expected:<2> but was:<0>
	at org.eclipse.jdt.core.groovy.tests.search.ConstructorReferenceSearchTests.testNewifyConstructorReferences2(ConstructorReferenceSearchTests.java:408)
Existing test failures 1
Status Test Failing since Duration
junit.framework.ComparisonFailure: 
----------- Expected ------------

------------ but was ------------
Problem : The import util.MyException is never used [ resource : </Project/src/p/Test.java> range : <18,34> category : <120> severity : <1>]

--------- Difference is ----------
 expected:<[]> but was:<[Problem : The import util.MyException is never used [ resource : </Project/src/p/Test.java> range : <18,34> category : <120> severity : <1>]
(12 more lines...)

Error summary

The build generated some errors. See the full build log for more details.

Jan 02, 2020 10:33:58 PM org.apache.http.impl.execchain.RetryExec execute
INFO: I/O exception (org.apache.http.NoHttpResponseException) caught when processing request to {s}->https://download.eclipse.org:443: The target server failed to respond
Jan 02, 2020 10:33:58 PM org.apache.http.impl.execchain.RetryExec execute
INFO: Retrying request to {s}->https://download.eclipse.org:443

(SWT:1448): Gtk-WARNING **: 22:35:25.546: gtk_widget_size_allocate(): attempt to allocate widget with width -3 and height -3

(SWT:1448): Gtk-CRITICAL **: 22:35:28.357: gtk_box_gadget_distribute: assertion 'size >= 0' failed in GtkScrollbar
TypeInferencingVisitorWithRequestor.findMethodNode: no match found for Main.main([Qjava.lang.String;)
TypeInferencingVisitorWithRequestor.findMethodNode: no match found for Main.main([Qjava.lang.String;)
CodeSelectRequestor: Could not proceed due to null declaring type for org.codehaus.groovy.ast.expr.BinaryExpression@ecbea[org.codehaus.groovy.ast.expr.VariableExpression@ecbe3[variable: it]("in" at 1:20:  "in" )org.codehaus.groovy.ast.expr.ListExpression@ee270[]]
CodeSelectRequestor: Could not proceed due to null declaring type for org.codehaus.groovy.ast.expr.RangeExpression@ebcdd
CodeSelectRequestor: Could not proceed due to null declaring type for org.codehaus.groovy.ast.expr.RangeExpression@ebcde
TypeInferencingVisitorWithRequestor.findMethodNode: no match found for Type.x(QList<Qjava.util.Date;>;)
TypeInferencingVisitorWithRequestor.findMethodNode: no match found for Type.x(QList<Qjava.lang.Number;>;)
TypeInferencingVisitorWithRequestor.findMethodNode: no match found for Type.x(QList<Qjava.lang.Number;>;)
TypeInferencingVisitorWithRequestor.findMethodNode: no match found for Type.x(QList<Qjava.util.Date;>;)
TypeInferencingVisitorWithRequestor.findMethodNode: no match found for Type.x(QList<Qjava.lang.Number;>;)
TypeInferencingVisitorWithRequestor.findMethodNode: no match found for Type.x(QList<Qjava.lang.Number;>;)
CodeSelectRequestor: Could not proceed due to null declaring type for org.codehaus.groovy.ast.expr.ConstantExpression@e8fc6[fff]
CodeSelectRequestor: Could not proceed due to null declaring type for org.codehaus.groovy.ast.expr.ConstantExpression@e8fca[fff]
CodeSelectRequestor: Could not proceed due to null declaring type for org.codehaus.groovy.ast.expr.ConstantExpression@e8fca[fff]
Waiting for: Java indexing... 3 files to index (/Project)
Waiting for: Java indexing... 22 files to index (/Project)
Waiting for: Java indexing... 22 files to index (/Project)
Waiting for: Java indexing... 22 files to index (/Project)
Waiting for: Java indexing... 22 files to index (/Project)
Waiting for: Java indexing... 22 files to index (/Project)
Waiting for: Java indexing... 21 files to index (/Project)
Waiting for: Java indexing... 21 files to index (/Project)
Waiting for: Java indexing... 7 files to index (/Project)
Waiting for: Java indexing... 21 files to index (/Project)