Build: #558 failed

Job: Default Job failed

Stages & jobs

  1. Default Stage

Job result summary

Completed
Duration
96 minutes
Agent
bamboo-24.af.pivotal.io
Revision
155ccf51435d003ae0bb5e9ff2b3dd87a13823b8 155ccf51435d003ae0bb5e9ff2b3dd87a13823b8
Total tests
6274
Failing since
#529 (Code changes detected – )

Tests

  • 6,274 tests in total
  • 4 tests failed
  • 3 failures are new
  • 24 tests were fixed
  • 140 tests were quarantined / skipped
  • 91 minutes taken in total.
New test failures 3
Status Test Duration
Collapse Failed DGMInferencingTests testDGM14 History
< 1 sec
java.lang.AssertionError: Expected type not found.
Expected: java.lang.Integer
Found: java.lang.Object
Declaring type: groovy.lang.Closure<V extends java.lang.Object>
ASTNode: org.codehaus.groovy.ast.expr.VariableExpression@ed367[variable: it]
Confidence: INFERRED

java.lang.AssertionError: 
(9 more lines...)
Collapse Failed InferencingTests testInstanceOf11 History
< 1 sec
java.lang.AssertionError: Expected type not found.
Expected: java.io.File
Found: java.lang.String
Declaring type: Search
ASTNode: org.codehaus.groovy.ast.expr.VariableExpression@e9ecc[variable: val]
Confidence: INFERRED

java.lang.AssertionError: 
(8 more lines...)
Collapse Failed InferencingTests testNothingIsUnknownWithCategories History
< 1 sec
java.lang.AssertionError: Should not have found any AST nodes with unknown confidence, but found:
[org.codehaus.groovy.ast.expr.ConstantExpression@f96d0[use], org.codehaus.groovy.ast.expr.ConstantExpression@101a5a[println], org.codehaus.groovy.ast.expr.ConstantExpression@108ed8[println], org.codehaus.groovy.ast.expr.ConstantExpression@156326[use]]
java.lang.AssertionError: 
Should not have found any AST nodes with unknown confidence, but found:
[org.codehaus.groovy.ast.expr.ConstantExpression@f96d0[use], org.codehaus.groovy.ast.expr.ConstantExpression@101a5a[println], org.codehaus.groovy.ast.expr.ConstantExpression@108ed8[println], org.codehaus.groovy.ast.expr.ConstantExpression@156326[use]]
	at org.eclipse.jdt.core.groovy.tests.search.InferencingTests.assertNoUnknowns(InferencingTests.java:44)
	at org.eclipse.jdt.core.groovy.tests.search.InferencingTests.testNothingIsUnknownWithCategories(InferencingTests.java:2547)
Existing test failures 1
Status Test Failing since Duration
junit.framework.ComparisonFailure: 
----------- Expected ------------

------------ but was ------------
Problem : The import util.MyException is never used [ resource : </Project/src/p/Test.java> range : <18,34> category : <120> severity : <1>]

--------- Difference is ----------
 expected:<[]> but was:<[Problem : The import util.MyException is never used [ resource : </Project/src/p/Test.java> range : <18,34> category : <120> severity : <1>]
(12 more lines...)
Fixed tests 24
Status Test Failing since Duration
Successful RenameMethodTests test1 History
Failing since build #557 (Code changes detected) 1 sec
Successful RenameMethodTests test10 History
Failing since build #557 (Code changes detected) 1 sec
Successful RenameMethodTests test2 History
Failing since build #557 (Code changes detected) 1 sec
Successful RenameMethodTests test3 History
Failing since build #557 (Code changes detected) 1 sec
Successful RenameMethodTests test4 History
Failing since build #557 (Code changes detected) 1 sec
Successful RenameMethodTests test5 History
Failing since build #557 (Code changes detected) 1 sec
Successful RenameMethodTests test6 History
Failing since build #557 (Code changes detected) 1 sec
Successful RenameMethodTests test7 History
Failing since build #557 (Code changes detected) 2 secs
Successful RenameMethodTests test8 History
Failing since build #557 (Code changes detected) 1 sec
Successful RenameMethodTests test9 History
Failing since build #557 (Code changes detected) 1 sec
Successful RenameMethodTests testAnonOverrides History
Failing since build #557 (Code changes detected) 10 secs
Successful RenameMethodTests testEnumOverrides History
Failing since build #557 (Code changes detected) 1 sec
Successful RenameMethodTests testEnumOverrides2 History
Failing since build #557 (Code changes detected) 1 sec
Successful RenameMethodTests testInitializer1 History
Failing since build #557 (Code changes detected) 1 sec
Successful RenameMethodTests testInitializer2 History
Failing since build #557 (Code changes detected) 1 sec
Successful RenameMethodTests testInitializer3 History
Failing since build #557 (Code changes detected) 1 sec
Successful RenameMethodTests testOverload1 History
Failing since build #557 (Code changes detected) 2 secs
Successful RenameMethodTests testOverload2 History
Failing since build #557 (Code changes detected) 2 secs
Successful RenameMethodTests testOverload3 History
Failing since build #557 (Code changes detected) 2 secs
Successful RenameMethodTests testStaticImport History
Failing since build #557 (Code changes detected) 1 sec
Successful BasicGroovyBuildTests testTraitIncremental History
Failing since build #557 (Code changes detected) 2 secs
Successful BuildAccessRulesTests testAccessForImport History
Failing since build #557 (Code changes detected) < 1 sec
Successful BinarySearchTests testMethodRefInInitializer History
Failing since build #557 (Code changes detected) 1 sec
Successful ConstructorReferenceSearchTests testNewifyConstructorReferences2 History
Failing since build #557 (Code changes detected) < 1 sec

Error summary

The build generated some errors. See the full build log for more details.


(SWT:23449): Gtk-WARNING **: 22:35:28.909: gtk_widget_size_allocate(): attempt to allocate widget with width -3 and height -3

(SWT:23449): Gtk-CRITICAL **: 22:35:31.705: gtk_box_gadget_distribute: assertion 'size >= 0' failed in GtkScrollbar
TypeInferencingVisitorWithRequestor.findMethodNode: no match found for Main.main([Qjava.lang.String;)
TypeInferencingVisitorWithRequestor.findMethodNode: no match found for Main.main([Qjava.lang.String;)
CodeSelectRequestor: Could not proceed due to null declaring type for org.codehaus.groovy.ast.expr.BinaryExpression@ecbea[org.codehaus.groovy.ast.expr.VariableExpression@ecbe3[variable: it]("in" at 1:20:  "in" )org.codehaus.groovy.ast.expr.ListExpression@ee270[]]
CodeSelectRequestor: Could not proceed due to null declaring type for org.codehaus.groovy.ast.expr.RangeExpression@ebcdd
CodeSelectRequestor: Could not proceed due to null declaring type for org.codehaus.groovy.ast.expr.RangeExpression@ebcde
TypeInferencingVisitorWithRequestor.findMethodNode: no match found for Type.x(QList<Qjava.util.Date;>;)
TypeInferencingVisitorWithRequestor.findMethodNode: no match found for Type.x(QList<Qjava.lang.Number;>;)
TypeInferencingVisitorWithRequestor.findMethodNode: no match found for Type.x(QList<Qjava.lang.Number;>;)
TypeInferencingVisitorWithRequestor.findMethodNode: no match found for Type.x(QList<Qjava.util.Date;>;)
TypeInferencingVisitorWithRequestor.findMethodNode: no match found for Type.x(QList<Qjava.lang.Number;>;)
CodeSelectRequestor: Could not proceed due to null declaring type for org.codehaus.groovy.ast.expr.ConstantExpression@e8fc6[fff]
CodeSelectRequestor: Could not proceed due to null declaring type for org.codehaus.groovy.ast.expr.ConstantExpression@e8fca[fff]
CodeSelectRequestor: Could not proceed due to null declaring type for org.codehaus.groovy.ast.expr.ConstantExpression@e8fca[fff]
Waiting for: Java indexing... 4 files to index (/Project)
Waiting for: Flushing content description cache.
Waiting for: Java indexing... 22 files to index (/Project)
Waiting for: Java indexing... 22 files to index (/Project)
Waiting for: Java indexing... 22 files to index (/Project)
Waiting for: Java indexing... 22 files to index (/Project)
Waiting for: Java indexing... 22 files to index (/Project)
Waiting for: Java indexing... 22 files to index (/Project)
Waiting for: Java indexing... 21 files to index (/Project)
Waiting for: Java indexing... 21 files to index (/Project)
Waiting for: Java indexing... 16 files to index (/opt/jdk8u232-b09/jre/lib/resources.jar)
Waiting for: Java indexing... 16 files to index (/opt/jdk8u232-b09/jre/lib/rt.jar)