Build: #561 failed

Job: Default Job failed

Stages & jobs

  1. Default Stage

Job result summary

Completed
Duration
95 minutes
Agent
bamboo-24.af.pivotal.io
Revision
f690a2420a98b4e4febae635ffac39c4a077c08c f690a2420a98b4e4febae635ffac39c4a077c08c
Total tests
6279
Failing since
#529 (Code changes detected – )

Tests

  • 6,279 tests in total
  • 2 tests failed
  • 1 failure is new
  • 1 test was fixed
  • 140 tests were quarantined / skipped
  • 91 minutes taken in total.
New test failures 1
Status Test Duration
Collapse Failed DGMInferencingTests testDGMClosure3 History
< 1 sec
java.lang.AssertionError: Expected type not found.
Expected: java.lang.String
Found: java.lang.Object
Declaring type: groovy.lang.Closure<V extends java.lang.Object>
ASTNode: org.codehaus.groovy.ast.expr.VariableExpression@ebcdb[variable: it]
Confidence: INFERRED

java.lang.AssertionError: 
(9 more lines...)
Existing test failures 1
Status Test Failing since Duration
java.lang.AssertionError: missing expected problem: Problem : The import util.MyException is never used [ resource : </Project/src/p/Test.java> range : <18,34> category : <120> severity : <1>]
	at org.eclipse.jdt.core.groovy.tests.builder.BasicGroovyBuildTests.testUpdateProjectPreferences(BasicGroovyBuildTests.java:3323)
Fixed tests 1
Status Test Failing since Duration
Successful BasicGroovyBuildTests testUpdateWorkspacePreferences History
Failing since build #560 (Code changes detected) < 1 sec

Error summary

The build generated some errors. See the full build log for more details.

Jan 08, 2020 9:34:11 PM org.apache.http.impl.execchain.RetryExec execute
INFO: I/O exception (org.apache.http.NoHttpResponseException) caught when processing request to {s}->https://download.eclipse.org:443: The target server failed to respond
Jan 08, 2020 9:34:11 PM org.apache.http.impl.execchain.RetryExec execute
INFO: Retrying request to {s}->https://download.eclipse.org:443

(SWT:13113): Gtk-WARNING **: 21:35:33.444: gtk_widget_size_allocate(): attempt to allocate widget with width -3 and height -3

(SWT:13113): Gtk-CRITICAL **: 21:35:36.225: gtk_box_gadget_distribute: assertion 'size >= 0' failed in GtkScrollbar
Waiting for: Refresh DSLD scripts
TypeInferencingVisitorWithRequestor.findMethodNode: no match found for Main.main([Qjava.lang.String;)
TypeInferencingVisitorWithRequestor.findMethodNode: no match found for Main.main([Qjava.lang.String;)
CodeSelectRequestor: Could not proceed due to null declaring type for org.codehaus.groovy.ast.expr.BinaryExpression@ecbea[org.codehaus.groovy.ast.expr.VariableExpression@ecbe3[variable: it]("in" at 1:20:  "in" )org.codehaus.groovy.ast.expr.ListExpression@ee270[]]
CodeSelectRequestor: Could not proceed due to null declaring type for org.codehaus.groovy.ast.expr.RangeExpression@ebcdd
CodeSelectRequestor: Could not proceed due to null declaring type for org.codehaus.groovy.ast.expr.RangeExpression@ebcde
TypeInferencingVisitorWithRequestor.findMethodNode: no match found for Type.x(QList<Qjava.util.Date;>;)
TypeInferencingVisitorWithRequestor.findMethodNode: no match found for Type.x(QList<Qjava.lang.Number;>;)
TypeInferencingVisitorWithRequestor.findMethodNode: no match found for Type.x(QList<Qjava.util.Date;>;)
TypeInferencingVisitorWithRequestor.findMethodNode: no match found for Type.x(QList<Qjava.lang.Number;>;)
TypeInferencingVisitorWithRequestor.findMethodNode: no match found for Type.x(QList<Qjava.lang.Number;>;)
CodeSelectRequestor: Could not proceed due to null declaring type for org.codehaus.groovy.ast.expr.ConstantExpression@e8fc6[fff]
CodeSelectRequestor: Could not proceed due to null declaring type for org.codehaus.groovy.ast.expr.ConstantExpression@e8fca[fff]
CodeSelectRequestor: Could not proceed due to null declaring type for org.codehaus.groovy.ast.expr.ConstantExpression@e8fca[fff]
Waiting for: Java indexing... 4 files to index (/Project)
Waiting for: Java indexing... 22 files to index (/Project)
Waiting for: Java indexing... 22 files to index (/Project)
Waiting for: Java indexing... 22 files to index (/Project)
Waiting for: Java indexing... 22 files to index (/Project)
Waiting for: Java indexing... 22 files to index (/Project)
Waiting for: Java indexing... 22 files to index (/Project)
Waiting for: Java indexing... 21 files to index (/Project)
Waiting for: Java indexing... 21 files to index (/Project)
Waiting for: Java indexing... 21 files to index (/Project)
Waiting for: Java indexing... 11 files to index (/opt/jdk8u232-b09/jre/lib/ext/nashorn.jar)