Build: #562 failed

Job: Default Job failed

Stages & jobs

  1. Default Stage

Job result summary

Completed
Duration
96 minutes
Agent
bamboo-21.af.pivotal.io
Revision
b667d1198497ca0eb44540afcee18a739afcfeea b667d1198497ca0eb44540afcee18a739afcfeea
Total tests
6279
Failing since
#529 (Code changes detected – )

Tests

  • 6,279 tests in total
  • 6 tests failed
  • 5 failures are new
  • 1 test was fixed
  • 140 tests were quarantined / skipped
  • 91 minutes taken in total.
New test failures 5
Status Test Duration
Collapse Failed BasicGroovyBuildTests testBuildJavaHelloWorld History
< 1 sec
org.junit.ComparisonFailure: unexpected recompiled units. lenExpected=1 lenActual=2 expected:<{p1.Hello[]}> but was:<{p1.Hello[,p1.Hello]}>
	at org.eclipse.jdt.core.groovy.tests.builder.BasicGroovyBuildTests.testBuildJavaHelloWorld(BasicGroovyBuildTests.java:175)
Collapse Failed BasicGroovyBuildTests testProjectBasedirAsOutputLocation History
< 1 sec
org.junit.ComparisonFailure: unexpected recompiled units. lenExpected=1 lenActual=2 expected:<{p.Script[]}> but was:<{p.Script[,p.Script]}>
	at org.eclipse.jdt.core.groovy.tests.builder.BasicGroovyBuildTests.testProjectBasedirAsOutputLocation(BasicGroovyBuildTests.java:274)
Collapse Failed BuildAccessRulesTests testAccessForLocalVariable History
< 1 sec
junit.framework.ComparisonFailure: 
----------- Expected ------------
Problem : Access restriction: The type 'BeanInfo' is not API (restriction on required library '##') [ resource : </Project/src/Foo.groovy> range : <51,59> category : <150> severity : <2>]

------------ but was ------------

--------- Difference is ----------
 expected:<[Problem : Access restriction: The type 'BeanInfo' is not API (restriction on required library '##') [ resource : </Project/src/Foo.groovy> range : <51,59> category : <150> severity : <2>]
(13 more lines...)
Collapse Failed DGMInferencingTests testDGM2a History
< 1 sec
java.lang.AssertionError: Expected type not found.
Expected: java.lang.String
Found: java.lang.Number
Declaring type: Z
ASTNode: org.codehaus.groovy.ast.expr.VariableExpression@11bb76[variable: value type: java.lang.Number -> java.lang.Number]
Confidence: EXACT

java.lang.AssertionError: 
(9 more lines...)
Collapse Failed InferencingTests testSpread3 History
< 1 sec
java.lang.AssertionError: Expected type not found.
Expected: java.lang.Integer
Found: java.lang.String
Declaring type: java.util.List<java.lang.Integer>
ASTNode: org.codehaus.groovy.ast.expr.ConstantExpression@ee634[value]
Confidence: UNKNOWN

java.lang.AssertionError: 
(8 more lines...)
Existing test failures 1
Status Test Failing since Duration
junit.framework.ComparisonFailure: 
----------- Expected ------------

------------ but was ------------
Problem : The import util.MyException is never used [ resource : </Project/src/p/Test.java> range : <18,34> category : <120> severity : <1>]

--------- Difference is ----------
 expected:<[]> but was:<[Problem : The import util.MyException is never used [ resource : </Project/src/p/Test.java> range : <18,34> category : <120> severity : <1>]
(12 more lines...)
Fixed tests 1
Status Test Failing since Duration
Successful DGMInferencingTests testDGMClosure3 History
Failing since build #561 (Code changes detected) < 1 sec

Error summary

The build generated some errors. See the full build log for more details.

Jan 09, 2020 5:03:25 PM org.apache.http.impl.execchain.RetryExec execute
INFO: I/O exception (org.apache.http.NoHttpResponseException) caught when processing request to {s}->https://download.eclipse.org:443: The target server failed to respond
Jan 09, 2020 5:03:25 PM org.apache.http.impl.execchain.RetryExec execute
INFO: Retrying request to {s}->https://download.eclipse.org:443

(SWT:3581): Gtk-WARNING **: 17:04:46.199: gtk_widget_size_allocate(): attempt to allocate widget with width -3 and height -3

(SWT:3581): Gtk-CRITICAL **: 17:04:48.911: gtk_box_gadget_distribute: assertion 'size >= 0' failed in GtkScrollbar
TypeInferencingVisitorWithRequestor.findMethodNode: no match found for Main.main([Qjava.lang.String;)
TypeInferencingVisitorWithRequestor.findMethodNode: no match found for Main.main([Qjava.lang.String;)
CodeSelectRequestor: Could not proceed due to null declaring type for org.codehaus.groovy.ast.expr.BinaryExpression@ecbea[org.codehaus.groovy.ast.expr.VariableExpression@ecbe3[variable: it]("in" at 1:20:  "in" )org.codehaus.groovy.ast.expr.ListExpression@ee270[]]
CodeSelectRequestor: Could not proceed due to null declaring type for org.codehaus.groovy.ast.expr.RangeExpression@ebcdd
CodeSelectRequestor: Could not proceed due to null declaring type for org.codehaus.groovy.ast.expr.RangeExpression@ebcde
TypeInferencingVisitorWithRequestor.findMethodNode: no match found for Type.x(QList<Qjava.util.Date;>;)
TypeInferencingVisitorWithRequestor.findMethodNode: no match found for Type.x(QList<Qjava.lang.Number;>;)
TypeInferencingVisitorWithRequestor.findMethodNode: no match found for Type.x(QList<Qjava.lang.Number;>;)
TypeInferencingVisitorWithRequestor.findMethodNode: no match found for Type.x(QList<Qjava.util.Date;>;)
TypeInferencingVisitorWithRequestor.findMethodNode: no match found for Type.x(QList<Qjava.lang.Number;>;)
CodeSelectRequestor: Could not proceed due to null declaring type for org.codehaus.groovy.ast.expr.ConstantExpression@e8fc6[fff]
CodeSelectRequestor: Could not proceed due to null declaring type for org.codehaus.groovy.ast.expr.ConstantExpression@e8fca[fff]
CodeSelectRequestor: Could not proceed due to null declaring type for org.codehaus.groovy.ast.expr.ConstantExpression@e8fca[fff]
Waiting for: Java indexing... 3 files to index (/Project)
Waiting for: Building workspace
Waiting for: Java indexing... 22 files to index (/Project)
Waiting for: Java indexing... 22 files to index (/Project)
Waiting for: Java indexing... 22 files to index (/Project)
Waiting for: Java indexing... 22 files to index (/Project)
Waiting for: Java indexing... 22 files to index (/Project)
Waiting for: Java indexing... 22 files to index (/Project)
Waiting for: Java indexing... 21 files to index (/Project)
Waiting for: Java indexing... 21 files to index (/Project)
Waiting for: Java indexing... 21 files to index (/opt/jdk8u232-b09/jre/lib/resources.jar)
Waiting for: Java indexing... 7 files to index (/opt/jdk8u232-b09/jre/lib/ext/jaccess.jar)