Build: #566 failed

Job: Default Job failed

Stages & jobs

  1. Default Stage

Job result summary

Completed
Duration
96 minutes
Agent
bamboo-16.af.pivotal.io
Revision
70065b0f02124b32b9ec067f23f004089ca9a6ed 70065b0f02124b32b9ec067f23f004089ca9a6ed
Total tests
6281
Failing since
#529 (Code changes detected – )

Tests

  • 6,281 tests in total
  • 25 tests failed
  • 24 failures are new
  • 140 tests were quarantined / skipped
  • 92 minutes taken in total.
New test failures 24
Status Test Duration
Collapse Failed RenameFieldTests test10 History
5 secs
org.junit.ComparisonFailure: invalid change expected:<...ef s() {
        "${[g}"
        "${this.g]}"
    }
}> but was:<...ef s() {
        "${[f}"
        "${this.f]}"
    }
(14 more lines...)
Collapse Failed RenameFieldTests test11 History
1 sec
org.junit.ComparisonFailure: invalid change expected:<...port static o.Other.[BAR

BAR
o.Other.BAR]> but was:<...port static o.Other.[FOO

FOO
o.Other.FOO]>
org.junit.ComparisonFailure: 
(10 more lines...)
Collapse Failed RenameFieldTests test13 History
1 sec
org.junit.ComparisonFailure: invalid change expected:<...2 = new MyBean(foo: [g].foo)
 }
}> but was:<...2 = new MyBean(foo: [f].foo)
 }
}>
org.junit.ComparisonFailure: 
invalid change expected:<...2 = new MyBean(foo: [g].foo)
	}
(6 more lines...)
Collapse Failed RenameFieldTests test14 History
1 sec
org.junit.ComparisonFailure: invalid change expected:<...r(Class bar) {
  foo[Bar = bar
 }
}

@groovy.transform.CompileStatic
class A {
 def one = new MyBean()
(50 more lines...)
Collapse Failed RenameFieldTests test15 History
1 sec
org.junit.ComparisonFailure: invalid change expected:<...Foo() {
  return foo[Bar
 }
}

void meth(MyBean bean) {
 bean.fooBar += 1
 bean.with { fooBar] += 1 }
(34 more lines...)
Collapse Failed RenameFieldTests test2 History
1 sec
org.junit.ComparisonFailure: invalid change expected:<...oid s() {
        c.[g = 3
        def f =  {f -> println(f)}
        c.g()
    }
}

class A {
(50 more lines...)
Collapse Failed RenameFieldTests test3 History
1 sec
org.junit.ComparisonFailure: invalid change expected:<... void s() {
        [g = g
        this.g = super.g
    }
}

class A extends C {
    def g = 7
(58 more lines...)
Collapse Failed RenameFieldTests test4 History
1 sec
org.junit.ComparisonFailure: invalid change expected:<...     this.f = super.[g]
    }
}

class A {
...> but was:<...     this.f = super.[f]
    }
}
(18 more lines...)
Collapse Failed RenameFieldTests test5 History
1 sec
org.junit.ComparisonFailure: invalid change expected:<...s A {
    {
        [g = g
        while (true) {
            def f = this.g
            f++
        }
        g]++
(34 more lines...)
Collapse Failed RenameFieldTests test6 History
1 sec
org.junit.ComparisonFailure: invalid change expected:<... {
        f = this.[g]
    }
}> but was:<... {
        f = this.[f]
    }
}>
org.junit.ComparisonFailure: 
(10 more lines...)
Collapse Failed RenameFieldTests test7 History
1 sec
org.junit.ComparisonFailure: invalid change expected:<...->
        f = this.[g]
    }
}> but was:<...->
        f = this.[f]
    }
}>
org.junit.ComparisonFailure: 
(10 more lines...)
Collapse Failed RenameFieldTests test8 History
1 sec
org.junit.ComparisonFailure: invalid change expected:<...s() {
        f = A.[g
        f = super.g
    }
}

class A extends C {
    static g = 7
(62 more lines...)
Collapse Failed RenameFieldTests test9 History
1 sec
org.junit.ComparisonFailure: invalid change expected:<...c def s() {
        [g = A.g
    }
}

class B extends A {
    public def f
    void m() {
(58 more lines...)
Collapse Failed RenameFieldTests testInitializer1 History
1 sec
org.junit.ComparisonFailure: invalid change expected:<... p
class A { 
    { [g }
    def g
    def other = g
    def doOperation= { g }
    { g] }
}> but was:<... p
(26 more lines...)
Collapse Failed RenameFieldTests testInitializer2 History
1 sec
org.junit.ComparisonFailure: invalid change expected:<... 
    A() { }
    { [g }
    def g
    def other = g
    def doOperation= { g }
    { g] }
}> but was:<... 
(26 more lines...)
Collapse Failed RenameFieldTests testInitializer3 History
1 sec
org.junit.ComparisonFailure: invalid change expected:<...   A(a,b) { }
    { [g }
    def g
    def other = g
    def doOperation= { g }
    { g] }
}> but was:<...   A(a,b) { }
    { [f }
(22 more lines...)
Collapse Failed RenameFieldTests testScript1 History
1 sec
org.junit.ComparisonFailure: invalid change expected:<...f val = new B()
val.[g

def val2 = ""
val2.f
val2 = val
val2.g]

(42 more lines...)
Collapse Failed RenameFieldTests testScript2 History
1 sec
org.junit.ComparisonFailure: invalid change expected:<...f val = new C()
val.[g

def val2 = ""
val2.f
val2 = val
val2.g]

(34 more lines...)
Collapse Failed BuildAccessRulesTests testAccessForPropertyGenerics History
< 1 sec
junit.framework.ComparisonFailure: 
----------- Expected ------------
Problem : Access restriction: The type 'BeanInfo' is not API (restriction on required library '##') [ resource : </Project/src/Foo.groovy> range : <39,47> category : <150> severity : <2>]

------------ but was ------------

--------- Difference is ----------
 expected:<[Problem : Access restriction: The type 'BeanInfo' is not API (restriction on required library '##') [ resource : </Project/src/Foo.groovy> range : <39,47> category : <150> severity : <2>]
(13 more lines...)
Collapse Failed ArrayInferencingTests testArrayProperty5 History
< 1 sec
java.lang.AssertionError: Expected type not found.
Expected: XX
Found: java.lang.String
Declaring type: java.lang.String
ASTNode: org.codehaus.groovy.ast.expr.ConstantExpression@edead[yy]
Confidence: UNKNOWN

java.lang.AssertionError: 
(8 more lines...)
Collapse Failed ConstructorReferenceSearchTests testConstructorReferences11a History
< 1 sec
java.lang.AssertionError: expected:<3> but was:<0>
	at org.eclipse.jdt.core.groovy.tests.search.ConstructorReferenceSearchTests.testConstructorReferences11a(ConstructorReferenceSearchTests.java:295)
Collapse Failed ConstructorReferenceSearchTests testConstructorReferences8 History
< 1 sec
java.lang.AssertionError: expected:<1> but was:<0>
	at org.eclipse.jdt.core.groovy.tests.search.ConstructorReferenceSearchTests.testConstructorReferences8(ConstructorReferenceSearchTests.java:218)
Collapse Failed MethodReferenceSearchTests testExplicitPropertyGetterSearch2 History
< 1 sec
java.lang.AssertionError: expected:<4> but was:<0>
	at org.eclipse.jdt.core.groovy.tests.search.MethodReferenceSearchTests.testExplicitPropertyGetterSearch2(MethodReferenceSearchTests.java:526)
Collapse Failed MethodReferenceSearchTests testExplicitPropertySetterSearch2 History
< 1 sec
java.lang.AssertionError: expected:<5> but was:<0>
	at org.eclipse.jdt.core.groovy.tests.search.MethodReferenceSearchTests.testExplicitPropertySetterSearch2(MethodReferenceSearchTests.java:668)
Existing test failures 1
Status Test Failing since Duration
junit.framework.ComparisonFailure: 
----------- Expected ------------

------------ but was ------------
Problem : The import util.MyException is never used [ resource : </Project/src/p/Test.java> range : <18,34> category : <120> severity : <1>]

--------- Difference is ----------
 expected:<[]> but was:<[Problem : The import util.MyException is never used [ resource : </Project/src/p/Test.java> range : <18,34> category : <120> severity : <1>]
(12 more lines...)

Error summary

The build generated some errors. See the full build log for more details.

Jan 11, 2020 8:06:57 PM org.apache.http.impl.execchain.RetryExec execute
INFO: I/O exception (org.apache.http.NoHttpResponseException) caught when processing request to {s}->https://download.eclipse.org:443: The target server failed to respond
Jan 11, 2020 8:06:57 PM org.apache.http.impl.execchain.RetryExec execute
INFO: Retrying request to {s}->https://download.eclipse.org:443

(SWT:811): Gtk-WARNING **: 20:08:25.555: gtk_widget_size_allocate(): attempt to allocate widget with width -3 and height -3

(SWT:811): Gtk-CRITICAL **: 20:08:28.485: gtk_box_gadget_distribute: assertion 'size >= 0' failed in GtkScrollbar
TypeInferencingVisitorWithRequestor.findMethodNode: no match found for Main.main([Qjava.lang.String;)
TypeInferencingVisitorWithRequestor.findMethodNode: no match found for Main.main([Qjava.lang.String;)
CodeSelectRequestor: Could not proceed due to null declaring type for org.codehaus.groovy.ast.expr.BinaryExpression@ecbea[org.codehaus.groovy.ast.expr.VariableExpression@ecbe3[variable: it]("in" at 1:20:  "in" )org.codehaus.groovy.ast.expr.ListExpression@ee270[]]
CodeSelectRequestor: Could not proceed due to null declaring type for org.codehaus.groovy.ast.expr.RangeExpression@ebcdd
CodeSelectRequestor: Could not proceed due to null declaring type for org.codehaus.groovy.ast.expr.RangeExpression@ebcde
TypeInferencingVisitorWithRequestor.findMethodNode: no match found for Type.x(QList<Qjava.util.Date;>;)
TypeInferencingVisitorWithRequestor.findMethodNode: no match found for Type.x(QList<Qjava.lang.Number;>;)
TypeInferencingVisitorWithRequestor.findMethodNode: no match found for Type.x(QList<Qjava.lang.Number;>;)
TypeInferencingVisitorWithRequestor.findMethodNode: no match found for Type.x(QList<Qjava.util.Date;>;)
TypeInferencingVisitorWithRequestor.findMethodNode: no match found for Type.x(QList<Qjava.lang.Number;>;)
TypeInferencingVisitorWithRequestor.findMethodNode: no match found for Type.x(QList<Qjava.lang.Number;>;)
CodeSelectRequestor: Could not proceed due to null declaring type for org.codehaus.groovy.ast.expr.ConstantExpression@e8fc6[fff]
CodeSelectRequestor: Could not proceed due to null declaring type for org.codehaus.groovy.ast.expr.ConstantExpression@e8fca[fff]
CodeSelectRequestor: Could not proceed due to null declaring type for org.codehaus.groovy.ast.expr.ConstantExpression@e8fca[fff]
Waiting for: Java indexing... 4 files to index (/Project)
Waiting for: Flushing content description cache.
Waiting for: Java indexing... 22 files to index (/Project)
Waiting for: Java indexing... 22 files to index (/Project)
Waiting for: Java indexing... 22 files to index (/Project)
Waiting for: Java indexing... 22 files to index (/Project)
Waiting for: Java indexing... 22 files to index (/Project)
Waiting for: Java indexing... 22 files to index (/Project)
Waiting for: Java indexing... 21 files to index (/Project)
Waiting for: Java indexing... 21 files to index (/Project)
Waiting for: Flushing content description cache.
Waiting for: Java indexing... 21 files to index (/Project)
Waiting for: Java indexing... 21 files to index (/Project)