Build: #567 failed

Job: Default Job failed

Stages & jobs

  1. Default Stage

Job result summary

Completed
Duration
96 minutes
Agent
bamboo-17.af.pivotal.io
Revision
c73fca8f7f1595a01fcaa6b189ba0536572d674f c73fca8f7f1595a01fcaa6b189ba0536572d674f
Total tests
6284
Failing since
#529 (Code changes detected – )

Tests

  • 6,284 tests in total
  • 4 tests failed
  • 3 failures are new
  • 24 tests were fixed
  • 140 tests were quarantined / skipped
  • 91 minutes taken in total.
New test failures 3
Status Test Duration
Collapse Failed BinarySearchTests testClassDecl2 History
1 sec
java.lang.AssertionError: Expecting 4 matches, but found 0

java.lang.AssertionError: 
Expecting 4 matches, but found 0

	at org.eclipse.jdt.core.groovy.tests.search.BinarySearchTests.assertMatches(BinarySearchTests.java:139)
	at org.eclipse.jdt.core.groovy.tests.search.BinarySearchTests.testClassDecl2(BinarySearchTests.java:172)
Collapse Failed ConstructorReferenceSearchTests testConstructorReferences3 History
< 1 sec
java.lang.AssertionError: expected:<3> but was:<0>
	at org.eclipse.jdt.core.groovy.tests.search.ConstructorReferenceSearchTests.testConstructorReferences3(ConstructorReferenceSearchTests.java:126)
Collapse Failed MethodReferenceSearchTests testGenericsMethodReferenceSearch History
< 1 sec
java.lang.AssertionError: expected:<1> but was:<0>
	at org.eclipse.jdt.core.groovy.tests.search.MethodReferenceSearchTests.testGenericsMethodReferenceSearch(MethodReferenceSearchTests.java:772)
Existing test failures 1
Status Test Failing since Duration
junit.framework.ComparisonFailure: 
----------- Expected ------------

------------ but was ------------
Problem : The import util.MyException is never used [ resource : </Project/src/p/Test.java> range : <18,34> category : <120> severity : <1>]

--------- Difference is ----------
 expected:<[]> but was:<[Problem : The import util.MyException is never used [ resource : </Project/src/p/Test.java> range : <18,34> category : <120> severity : <1>]
(12 more lines...)
Fixed tests 24
Status Test Failing since Duration
Successful RenameFieldTests test10 History
Failing since build #566 (Code changes detected) 4 secs
Successful RenameFieldTests test11 History
Failing since build #566 (Code changes detected) 1 sec
Successful RenameFieldTests test13 History
Failing since build #566 (Code changes detected) 1 sec
Successful RenameFieldTests test14 History
Failing since build #566 (Code changes detected) 1 sec
Successful RenameFieldTests test15 History
Failing since build #566 (Code changes detected) 1 sec
Successful RenameFieldTests test2 History
Failing since build #566 (Code changes detected) 1 sec
Successful RenameFieldTests test3 History
Failing since build #566 (Code changes detected) 1 sec
Successful RenameFieldTests test4 History
Failing since build #566 (Code changes detected) 1 sec
Successful RenameFieldTests test5 History
Failing since build #566 (Code changes detected) 1 sec
Successful RenameFieldTests test6 History
Failing since build #566 (Code changes detected) 1 sec
Successful RenameFieldTests test7 History
Failing since build #566 (Code changes detected) 1 sec
Successful RenameFieldTests test8 History
Failing since build #566 (Code changes detected) 1 sec
Successful RenameFieldTests test9 History
Failing since build #566 (Code changes detected) 1 sec
Successful RenameFieldTests testInitializer1 History
Failing since build #566 (Code changes detected) 1 sec
Successful RenameFieldTests testInitializer2 History
Failing since build #566 (Code changes detected) 1 sec
Successful RenameFieldTests testInitializer3 History
Failing since build #566 (Code changes detected) 1 sec
Successful RenameFieldTests testScript1 History
Failing since build #566 (Code changes detected) 1 sec
Successful RenameFieldTests testScript2 History
Failing since build #566 (Code changes detected) 1 sec
Successful BuildAccessRulesTests testAccessForPropertyGenerics History
Failing since build #566 (Code changes detected) < 1 sec
Successful ArrayInferencingTests testArrayProperty5 History
Failing since build #566 (Code changes detected) < 1 sec
Successful ConstructorReferenceSearchTests testConstructorReferences11a History
Failing since build #566 (Code changes detected) < 1 sec
Successful ConstructorReferenceSearchTests testConstructorReferences8 History
Failing since build #566 (Code changes detected) < 1 sec
Successful MethodReferenceSearchTests testExplicitPropertyGetterSearch2 History
Failing since build #566 (Code changes detected) < 1 sec
Successful MethodReferenceSearchTests testExplicitPropertySetterSearch2 History
Failing since build #566 (Code changes detected) < 1 sec

Error summary

The build generated some errors. See the full build log for more details.

Jan 13, 2020 9:37:57 PM org.apache.http.impl.execchain.RetryExec execute
INFO: I/O exception (org.apache.http.NoHttpResponseException) caught when processing request to {s}->https://download.eclipse.org:443: The target server failed to respond
Jan 13, 2020 9:37:57 PM org.apache.http.impl.execchain.RetryExec execute
INFO: Retrying request to {s}->https://download.eclipse.org:443

(SWT:11337): Gtk-CRITICAL **: 21:39:24.656: gtk_box_gadget_distribute: assertion 'size >= 0' failed in GtkScrollbar
TypeInferencingVisitorWithRequestor.findMethodNode: no match found for Main.main([Qjava.lang.String;)
TypeInferencingVisitorWithRequestor.findMethodNode: no match found for Main.main([Qjava.lang.String;)
CodeSelectRequestor: Could not proceed due to null declaring type for org.codehaus.groovy.ast.expr.BinaryExpression@ecbea[org.codehaus.groovy.ast.expr.VariableExpression@ecbe3[variable: it]("in" at 1:20:  "in" )org.codehaus.groovy.ast.expr.ListExpression@ee270[]]
CodeSelectRequestor: Could not proceed due to null declaring type for org.codehaus.groovy.ast.expr.RangeExpression@ebcdd
CodeSelectRequestor: Could not proceed due to null declaring type for org.codehaus.groovy.ast.expr.RangeExpression@ebcde
TypeInferencingVisitorWithRequestor.findMethodNode: no match found for Type.x(QList<Qjava.util.Date;>;)
TypeInferencingVisitorWithRequestor.findMethodNode: no match found for Type.x(QList<Qjava.lang.Number;>;)
TypeInferencingVisitorWithRequestor.findMethodNode: no match found for Type.x(QList<Qjava.lang.Number;>;)
TypeInferencingVisitorWithRequestor.findMethodNode: no match found for Type.x(QList<Qjava.util.Date;>;)
TypeInferencingVisitorWithRequestor.findMethodNode: no match found for Type.x(QList<Qjava.lang.Number;>;)
TypeInferencingVisitorWithRequestor.findMethodNode: no match found for Type.x(QList<Qjava.lang.Number;>;)
CodeSelectRequestor: Could not proceed due to null declaring type for org.codehaus.groovy.ast.expr.ConstantExpression@e8fc6[fff]
CodeSelectRequestor: Could not proceed due to null declaring type for org.codehaus.groovy.ast.expr.ConstantExpression@e8fca[fff]
CodeSelectRequestor: Could not proceed due to null declaring type for org.codehaus.groovy.ast.expr.ConstantExpression@e8fca[fff]
Waiting for: Java indexing... 4 files to index (/Project)
Waiting for: Java indexing... 22 files to index (/Project)
Waiting for: Java indexing... 22 files to index (/Project)
Waiting for: Java indexing... 22 files to index (/Project)
Waiting for: Java indexing... 22 files to index (/Project)
Waiting for: Java indexing... 22 files to index (/Project)
Waiting for: Java indexing... 22 files to index (/Project)
Waiting for: Java indexing... 20 files to index (/Project)
Waiting for: Java indexing... 21 files to index (/Project)
Waiting for: Java indexing... 21 files to index (/Project)
Waiting for: Java indexing... 3 files to index (/Project)