Build: #574 failed

Job: Default Job failed

Stages & jobs

  1. Default Stage

Test results

  • 6,283 tests in total
  • 7 tests failed
  • 6 failures are new
  • 1 test was fixed
  • 140 tests were quarantined / skipped
  • 92 minutes taken in total.

Build 574 has the following 7 errors: 6 new failure(s) occurred since the previous build.

New test failures 6
Status Test Duration
Collapse Failed BasicGroovyBuildTests testTaskMarkerSharedDescription History
< 1 sec
org.eclipse.core.internal.resources.ResourceException: Marker id 248 not found.
	at org.eclipse.jdt.core.groovy.tests.builder.BasicGroovyBuildTests.testTaskMarkerSharedDescription(BasicGroovyBuildTests.java:2618)
Collapse Failed BuildAccessRulesTests testAccessForFieldGenerics History
< 1 sec
junit.framework.ComparisonFailure: 
----------- Expected ------------
Problem : Access restriction: The type 'BeanInfo' is not API (restriction on required library '##') [ resource : </Project/src/Foo.groovy> range : <47,55> category : <150> severity : <2>]

------------ but was ------------

--------- Difference is ----------
 expected:<[Problem : Access restriction: The type 'BeanInfo' is not API (restriction on required library '##') [ resource : </Project/src/Foo.groovy> range : <47,55> category : <150> severity : <2>]
(13 more lines...)
Collapse Failed BinarySearchTests testClassDecl1 History
1 sec
java.lang.AssertionError: Expecting 12 matches, but found 0

java.lang.AssertionError: 
Expecting 12 matches, but found 0

	at org.eclipse.jdt.core.groovy.tests.search.BinarySearchTests.assertMatches(BinarySearchTests.java:139)
	at org.eclipse.jdt.core.groovy.tests.search.BinarySearchTests.testClassDecl1(BinarySearchTests.java:165)
Collapse Failed ConstructorReferenceSearchTests testConstructorReferences8 History
< 1 sec
java.lang.AssertionError: expected:<1> but was:<0>
	at org.eclipse.jdt.core.groovy.tests.search.ConstructorReferenceSearchTests.testConstructorReferences8(ConstructorReferenceSearchTests.java:218)
Collapse Failed OperatorOverloadingInferencingTests testGetAt1 History
< 1 sec
java.lang.AssertionError: Expected type not found.
Expected: java.lang.Object
Found: Foo
Declaring type: Search
ASTNode: org.codehaus.groovy.ast.expr.VariableExpression@10d63a[variable: xxx]
Confidence: INFERRED

java.lang.AssertionError: 
(8 more lines...)
Collapse Failed TypeReferenceSearchTests testFindClassDeclarationWithPattern History
< 1 sec
java.lang.AssertionError: Number of results found expected:<2> but was:<0>
	at org.eclipse.jdt.core.groovy.tests.search.TypeReferenceSearchTests.testFindClassDeclarationWithPattern(TypeReferenceSearchTests.java:220)
Existing test failures 1
Status Test Failing since Duration
junit.framework.ComparisonFailure: 
----------- Expected ------------

------------ but was ------------
Problem : The import util.MyException is never used [ resource : </Project/src/p/Test.java> range : <18,34> category : <120> severity : <1>]

--------- Difference is ----------
 expected:<[]> but was:<[Problem : The import util.MyException is never used [ resource : </Project/src/p/Test.java> range : <18,34> category : <120> severity : <1>]
(12 more lines...)