Build: #616 failed

Job: Default Job failed

Stages & jobs

  1. Default Stage

Job result summary

Completed
Duration
100 minutes
Agent
bamboo-13.af.pivotal.io
Revision
6effbf75085f86e2fd9efa01a3519bea51c41195 6effbf75085f86e2fd9efa01a3519bea51c41195
Total tests
6310
Fixed in
#624 (Code changes detected)

Tests

  • 6,310 tests in total
  • 8 tests failed
  • 8 failures are new
  • 136 tests were quarantined / skipped
  • 94 minutes taken in total.
New test failures 8
Status Test Duration
Collapse Failed JUnit3TestFinderTests testFindAllTestSuites History
1 sec
org.eclipse.jdt.core.JavaModelException: /TestProject/src/p/script.groovy already exists in target
	at org.codehaus.groovy.eclipse.junit.test.JUnit3TestFinderTests.testFindAllTestSuites(JUnit3TestFinderTests.groovy:82)
Collapse Failed JUnit3TestFinderTests testFinderOfNonPublicSubclass History
4 secs
org.eclipse.jdt.core.JavaModelException: /TestProject/src/p/script.groovy already exists in target
	at org.codehaus.groovy.eclipse.junit.test.JUnit3TestFinderTests.testFinderOfNonPublicSubclass(JUnit3TestFinderTests.groovy:66)
Collapse Failed JUnit3TestFinderTests testFinderOfSubclass History
2 secs
org.eclipse.jdt.core.JavaModelException: /TestProject/src/p/script.groovy already exists in target
	at org.codehaus.groovy.eclipse.junit.test.JUnit3TestFinderTests.testFinderOfSubclass(JUnit3TestFinderTests.groovy:50)
Collapse Failed JUnit4TestFinderTests testFindAllTestSuites History
1 sec
org.eclipse.jdt.core.JavaModelException: /TestProject/src/p/script.groovy already exists in target
	at org.codehaus.groovy.eclipse.junit.test.JUnit4TestFinderTests.testFindAllTestSuites(JUnit4TestFinderTests.groovy:123)
Collapse Failed JUnit4TestFinderTests testFinderOfNonPublicSubclass History
4 secs
org.eclipse.jdt.core.JavaModelException: /TestProject/src/p/script.groovy already exists in target
	at org.codehaus.groovy.eclipse.junit.test.JUnit4TestFinderTests.testFinderOfNonPublicSubclass(JUnit4TestFinderTests.groovy:67)
Collapse Failed JUnit4TestFinderTests testFinderOfSubclass History
1 sec
org.eclipse.jdt.core.JavaModelException: /TestProject/src/p/script.groovy already exists in target
	at org.codehaus.groovy.eclipse.junit.test.JUnit4TestFinderTests.testFinderOfSubclass(JUnit4TestFinderTests.groovy:51)
Collapse Failed DGMInferencingTests testDGM32 History
< 1 sec
java.lang.AssertionError: Expected type not found.
Expected: java.io.BufferedReader
Found: java.lang.Object
Declaring type: groovy.lang.Closure<V extends java.lang.Object>
ASTNode: org.codehaus.groovy.ast.expr.VariableExpression@f007f[variable: it]
Confidence: INFERRED

java.lang.AssertionError: 
(9 more lines...)
Collapse Failed DGMInferencingTests testDGMClosure11 History
< 1 sec
java.lang.AssertionError: Expected type not found.
Expected: java.lang.Integer
Found: java.lang.Object
Declaring type: Search
ASTNode: org.codehaus.groovy.ast.expr.VariableExpression@f0440[variable: i]
Confidence: INFERRED

java.lang.AssertionError: 
(9 more lines...)

Error summary

The build generated some errors. See the full build log for more details.

Feb 26, 2020 11:04:51 PM org.apache.http.impl.execchain.RetryExec execute
INFO: I/O exception (org.apache.http.NoHttpResponseException) caught when processing request to {s}->https://download.eclipse.org:443: The target server failed to respond
Feb 26, 2020 11:04:51 PM org.apache.http.impl.execchain.RetryExec execute
INFO: Retrying request to {s}->https://download.eclipse.org:443
Feb 26, 2020 11:04:53 PM org.apache.http.impl.execchain.RetryExec execute
INFO: I/O exception (org.apache.http.NoHttpResponseException) caught when processing request to {s}->https://download.eclipse.org:443: The target server failed to respond
Feb 26, 2020 11:04:53 PM org.apache.http.impl.execchain.RetryExec execute
INFO: Retrying request to {s}->https://download.eclipse.org:443
Feb 26, 2020 11:04:55 PM org.apache.http.impl.execchain.RetryExec execute
INFO: I/O exception (org.apache.http.NoHttpResponseException) caught when processing request to {s}->https://download.eclipse.org:443: The target server failed to respond
Feb 26, 2020 11:04:55 PM org.apache.http.impl.execchain.RetryExec execute
INFO: Retrying request to {s}->https://download.eclipse.org:443
Feb 26, 2020 11:05:08 PM org.apache.http.impl.execchain.RetryExec execute
INFO: I/O exception (org.apache.http.NoHttpResponseException) caught when processing request to {s}->https://download.eclipse.org:443: The target server failed to respond
Feb 26, 2020 11:05:08 PM org.apache.http.impl.execchain.RetryExec execute
INFO: Retrying request to {s}->https://download.eclipse.org:443
Feb 26, 2020 11:05:21 PM org.apache.http.impl.execchain.RetryExec execute
INFO: I/O exception (org.apache.http.NoHttpResponseException) caught when processing request to {s}->https://download.eclipse.org:443: The target server failed to respond
Feb 26, 2020 11:05:21 PM org.apache.http.impl.execchain.RetryExec execute
INFO: Retrying request to {s}->https://download.eclipse.org:443
Feb 26, 2020 11:05:28 PM org.apache.http.impl.execchain.RetryExec execute
INFO: I/O exception (org.apache.http.NoHttpResponseException) caught when processing request to {s}->https://download.eclipse.org:443: The target server failed to respond
Feb 26, 2020 11:05:28 PM org.apache.http.impl.execchain.RetryExec execute
INFO: Retrying request to {s}->https://download.eclipse.org:443
Feb 26, 2020 11:06:47 PM org.apache.http.impl.execchain.RetryExec execute
INFO: I/O exception (org.apache.http.NoHttpResponseException) caught when processing request to {s}->https://download.eclipse.org:443: The target server failed to respond
Feb 26, 2020 11:06:47 PM org.apache.http.impl.execchain.RetryExec execute
INFO: Retrying request to {s}->https://download.eclipse.org:443
Feb 26, 2020 11:07:01 PM org.apache.http.impl.execchain.RetryExec execute
INFO: I/O exception (org.apache.http.NoHttpResponseException) caught when processing request to {s}->https://download.eclipse.org:443: The target server failed to respond
Feb 26, 2020 11:07:01 PM org.apache.http.impl.execchain.RetryExec execute
INFO: Retrying request to {s}->https://download.eclipse.org:443

(SWT:25931): Gtk-WARNING **: 23:07:09.773: gtk_widget_size_allocate(): attempt to allocate widget with width -3 and height -3

(SWT:25931): Gtk-CRITICAL **: 23:07:12.451: gtk_box_gadget_distribute: assertion 'size >= 0' failed in GtkScrollbar
Waiting for: Refresh DSLD scripts
TypeInferencingVisitorWithRequestor.findMethodNode: no match found for Main.main([Qjava.lang.String;)
TypeInferencingVisitorWithRequestor.findMethodNode: no match found for Main.main([Qjava.lang.String;)
CodeSelectRequestor: Could not proceed due to null declaring type for org.codehaus.groovy.ast.expr.BinaryExpression@ecbea[org.codehaus.groovy.ast.expr.VariableExpression@ecbe3[variable: it]("in" at 1:20:  "in" )org.codehaus.groovy.ast.expr.ListExpression@ee270[]]
CodeSelectRequestor: Could not proceed due to null declaring type for org.codehaus.groovy.ast.expr.RangeExpression@ebcdd
CodeSelectRequestor: Could not proceed due to null declaring type for org.codehaus.groovy.ast.expr.RangeExpression@ebcde
TypeInferencingVisitorWithRequestor.findMethodNode: no match found for Type.x(QList<Qjava.util.Date;>;)
TypeInferencingVisitorWithRequestor.findMethodNode: no match found for Type.x(QList<Qjava.lang.Number;>;)
TypeInferencingVisitorWithRequestor.findMethodNode: no match found for Type.x(QList<Qjava.util.Date;>;)
TypeInferencingVisitorWithRequestor.findMethodNode: no match found for Type.x(QList<Qjava.lang.Number;>;)
CodeSelectRequestor: Could not proceed due to null declaring type for org.codehaus.groovy.ast.expr.ConstantExpression@e8fc6[fff]
CodeSelectRequestor: Could not proceed due to null declaring type for org.codehaus.groovy.ast.expr.ConstantExpression@e8fca[fff]
CodeSelectRequestor: Could not proceed due to null declaring type for org.codehaus.groovy.ast.expr.ConstantExpression@e8fca[fff]
Waiting for: Java indexing... 22 files to index (/Project)
Waiting for: Java indexing... 22 files to index (/Project)
Waiting for: Java indexing... 22 files to index (/Project)
Waiting for: Java indexing... 4 files to index (/opt/bamboo-home/xml-data/build-dir/GRECLIPSE-GE49-JOB1/ide-test/org.codehaus.groovy.alltests/target/work/plugins/org.eclipse.jdt.groovy.core.tests.builder_3.7.0.v202002262304-e1809/lib/binGroovySearch.jar)
Waiting for: Java indexing... 22 files to index (/Project)
Waiting for: Java indexing... 22 files to index (/Project)
Waiting for: Java indexing... 22 files to index (/Project)
Waiting for: Java indexing... 21 files to index (/Project)
Waiting for: Java indexing... 21 files to index (/Project)
Waiting for: Flushing content description cache.
Waiting for: Java indexing... 20 files to index (/Project)
Waiting for: Java indexing... 14 files to index (/opt/jdk8u232-b09/jre/lib/jce.jar)