Build: #510 failed Changes by Eric Milles

Build result summary

Details

Completed
Duration
94 minutes
Labels
None
Agent
bamboo-18.af.pivotal.io
Revision
9641173a5bdd9184bd784d87408c84c1dec7b701 9641173a5bdd9184bd784d87408c84c1dec7b701
Total tests
6156
Failing since
#448 (Changes by Eric Milles)

Responsible

Code commits

Author Commit Message Commit date
Eric Milles Eric Milles 9641173a5bdd9184bd784d87408c84c1dec7b701 9641173a5bdd9184bd784d87408c84c1dec7b701 ClassNode#hasClass: delegate to redirect
Eric Milles Eric Milles 0b114bf0a02a4a6b0311b6817cbfd9d0983e86ea 0b114bf0a02a4a6b0311b6817cbfd9d0983e86ea GROOVY-9238
Eric Milles Eric Milles 0081e199e767c2489b7b2398d3eb30fc4cb61de5 0081e199e767c2489b7b2398d3eb30fc4cb61de5 Create resolved nodes for java.lang.Override and groovy.transform.Trait

Configuration changes

Plan configuration has changed since the last successful build. See the plan audit log for more details.

Tests

New test failures 3
Status Test View job Duration
Collapse Failed BasicGroovyBuildTests testInners_983 History
Default Job < 1 sec
org.junit.ComparisonFailure: unexpected recompiled units. lenExpected=3 lenActual=6 expected:<{Client,[Out]er,Outer$Inner}> but was:<{Client,[Client,Outer,Outer,Outer$Inn]er,Outer$Inner}>
	at org.eclipse.jdt.core.groovy.tests.builder.BasicGroovyBuildTests.testInners_983(BasicGroovyBuildTests.java:297)
Collapse Failed DGMInferencingTests testDGM40 History
Default Job < 1 sec
java.lang.AssertionError: Expected type not found.
Expected: java.io.PrintWriter
Found: java.lang.Object
Declaring type: groovy.lang.Closure<V extends java.lang.Object>
ASTNode: org.codehaus.groovy.ast.expr.VariableExpression@f1349[variable: it]
Confidence: INFERRED

java.lang.AssertionError: 
(9 more lines...)
Collapse Failed MethodReferenceSearchTests testGenericsMethodReferenceSearch History
Default Job < 1 sec
java.lang.AssertionError: expected:<0> but was:<1>
	at org.eclipse.jdt.core.groovy.tests.search.MethodReferenceSearchTests.testGenericsMethodReferenceSearch(MethodReferenceSearchTests.java:711)
Existing test failures 1
Status Test Failing since View job Duration
junit.framework.ComparisonFailure: 
----------- Expected ------------

------------ but was ------------
Problem : The import util.MyException is never used [ resource : </Project/src/p/Test.java> range : <18,34> category : <120> severity : <1>]

--------- Difference is ----------
 expected:<[]> but was:<[Problem : The import util.MyException is never used [ resource : </Project/src/p/Test.java> range : <18,34> category : <120> severity : <1>]
(12 more lines...)
Fixed tests 5
Status Test Failing since View job Duration
Successful BuildAccessRulesTests testAccessForField History
Failing since build #509 (Changes by Eric Milles) Default Job < 1 sec
Successful BuildAccessRulesTests testAccessForPropertyGenerics History
Failing since build #509 (Changes by Eric Milles) Default Job < 1 sec
Successful ConstructorReferenceSearchTests testNewifyConstructorReferences1 History
Failing since build #509 (Changes by Eric Milles) Default Job < 1 sec
Successful ConstructorReferenceSearchTests testConstructorReferences7 History
Failing since build #509 (Changes by Eric Milles) Default Job < 1 sec
Successful DGMInferencingTests testDGM17 History
Failing since build #509 (Changes by Eric Milles) Default Job < 1 sec

Jira issues

IssueDescriptionStatus
Unknown Issue TypeGROOVY-9238Could not obtain issue details from Jira