Greclipse for E43 (*no* Java 8 support)

Build: #293 failed Child of GRECLIPSE-E43J8P-320

Build result summary

Details

Completed
Duration
74 minutes
Labels
None
Agent
bamboo-02.af.pivotal.io
Revision
5d0997df5e09b4826ecd01010415eb74797612d9 5d0997df5e09b4826ecd01010415eb74797612d9
Total tests
3874
Failing since
#287 (Child of GRECLIPSE-E43J8P-314)

Responsible

This build has been failing since #287
No one has taken responsibility

Code commits

Author Commit Message Commit date
Eric Milles &lt;eric.milles@thomsonreuters.com&gt; Eric Milles <eric.milles@thomsonreuters.com> 5d0997df5e09b4826ecd01010415eb74797612d9 5d0997df5e09b4826ecd01010415eb74797612d9 Fix organize imports for case of array initializer
Eric Milles &lt;eric.milles@thomsonreuters.com&gt; Eric Milles <eric.milles@thomsonreuters.com> c5fca2829829836c5c0b3adf0c18deefd7f0cc80 c5fca2829829836c5c0b3adf0c18deefd7f0cc80 Fix for NPE when tabbing in unclosed string literal
Eric Milles &lt;eric.milles@thomsonreuters.com&gt; Eric Milles <eric.milles@thomsonreuters.com> 8ab31f91ad2d7c54fede80e19a12d0102d8e3220 8ab31f91ad2d7c54fede80e19a12d0102d8e3220 Add build project before 'is test' check

Tests

Existing test failures 9
Status Test Failing since View job Duration
java.lang.AssertionError: Should have found 3 test classes. Expression: (testTypes.size() == 3)
	at org.codehaus.groovy.runtime.InvokerHelper.assertFailed(InvokerHelper.java:415)
	at org.codehaus.groovy.runtime.ScriptBytecodeAdapter.assertFailed(ScriptBytecodeAdapter.java:658)
	at org.codehaus.groovy.eclipse.junit.test.JUnit3TestFinderTests.testFindAllTestSuites(JUnit3TestFinderTests.groovy:114)
java.lang.AssertionError: Groovy type Hello should be a JUnit 3 test (even though it is non-public). Expression: (new org.eclipse.jdt.internal.junit.launcher.JUnit3TestFinder().isTest(type) == expected). Values: expected = true
	at org.codehaus.groovy.runtime.InvokerHelper.assertFailed(InvokerHelper.java:415)
	at org.codehaus.groovy.runtime.ScriptBytecodeAdapter.assertFailed(ScriptBytecodeAdapter.java:658)
	at org.codehaus.groovy.eclipse.junit.test.JUnit3TestFinderTests.assertTypeIsTest(JUnit3TestFinderTests.groovy:32)
java.lang.AssertionError: Groovy type Hello should be a JUnit 3 test . Expression: (new org.eclipse.jdt.internal.junit.launcher.JUnit3TestFinder().isTest(type) == expected). Values: expected = true
	at org.codehaus.groovy.runtime.InvokerHelper.assertFailed(InvokerHelper.java:415)
	at org.codehaus.groovy.runtime.ScriptBytecodeAdapter.assertFailed(ScriptBytecodeAdapter.java:658)
	at org.codehaus.groovy.eclipse.junit.test.JUnit3TestFinderTests.assertTypeIsTest(JUnit3TestFinderTests.groovy:32)
	at org.codehaus.groovy.eclipse.junit.test.JUnit3TestFinderTests.assertTypeIsTest(JUnit3TestFinderTests.groovy)
java.lang.AssertionError: Groovy type Hello should be a JUnit 4 test . Expression: (new org.eclipse.jdt.internal.junit.launcher.JUnit4TestFinder().isTest(type) == expected). Values: expected = true
	at org.codehaus.groovy.runtime.InvokerHelper.assertFailed(InvokerHelper.java:415)
	at org.codehaus.groovy.runtime.ScriptBytecodeAdapter.assertFailed(ScriptBytecodeAdapter.java:658)
	at org.codehaus.groovy.eclipse.junit.test.JUnit4TestFinderTests.assertTypeIsTest(JUnit4TestFinderTests.groovy:33)
	at org.codehaus.groovy.eclipse.junit.test.JUnit4TestFinderTests.assertTypeIsTest(JUnit4TestFinderTests.groovy)
java.lang.AssertionError: Should have found 6 test classes. Expression: (testTypes.size() == 6)
	at org.codehaus.groovy.runtime.InvokerHelper.assertFailed(InvokerHelper.java:415)
	at org.codehaus.groovy.runtime.ScriptBytecodeAdapter.assertFailed(ScriptBytecodeAdapter.java:658)
	at org.codehaus.groovy.eclipse.junit.test.JUnit4TestFinderTests.testFindAllTestSuites(JUnit4TestFinderTests.groovy:190)
java.lang.AssertionError: Hello should be a test type for Hello.groovy. Expression: found. Values: found = false
	at org.codehaus.groovy.runtime.InvokerHelper.assertFailed(InvokerHelper.java:415)
	at org.codehaus.groovy.runtime.ScriptBytecodeAdapter.assertFailed(ScriptBytecodeAdapter.java:658)
	at org.codehaus.groovy.eclipse.junit.test.JUnit4TestFinderTests.testFindTestWithExpectedException(JUnit4TestFinderTests.groovy:130)
java.lang.AssertionError: Groovy type Hello should be a JUnit 4 test . Expression: (new org.eclipse.jdt.internal.junit.launcher.JUnit4TestFinder().isTest(type) == expected). Values: expected = true
	at org.codehaus.groovy.runtime.InvokerHelper.assertFailed(InvokerHelper.java:415)
	at org.codehaus.groovy.runtime.ScriptBytecodeAdapter.assertFailed(ScriptBytecodeAdapter.java:658)
	at org.codehaus.groovy.eclipse.junit.test.JUnit4TestFinderTests.assertTypeIsTest(JUnit4TestFinderTests.groovy:33)
	at org.codehaus.groovy.eclipse.junit.test.JUnit4TestFinderTests.assertTypeIsTest(JUnit4TestFinderTests.groovy)
java.lang.AssertionError: Groovy type Hello should be a JUnit 4 test (even though it is non-public). Expression: (new org.eclipse.jdt.internal.junit.launcher.JUnit4TestFinder().isTest(type) == expected). Values: expected = true
	at org.codehaus.groovy.runtime.InvokerHelper.assertFailed(InvokerHelper.java:415)
	at org.codehaus.groovy.runtime.ScriptBytecodeAdapter.assertFailed(ScriptBytecodeAdapter.java:658)
	at org.codehaus.groovy.eclipse.junit.test.JUnit4TestFinderTests.assertTypeIsTest(JUnit4TestFinderTests.groovy:33)
java.lang.AssertionError: Groovy type Hello should be a JUnit 4 test . Expression: (new org.eclipse.jdt.internal.junit.launcher.JUnit4TestFinder().isTest(type) == expected). Values: expected = true
	at org.codehaus.groovy.runtime.InvokerHelper.assertFailed(InvokerHelper.java:415)
	at org.codehaus.groovy.runtime.ScriptBytecodeAdapter.assertFailed(ScriptBytecodeAdapter.java:658)
	at org.codehaus.groovy.eclipse.junit.test.JUnit4TestFinderTests.assertTypeIsTest(JUnit4TestFinderTests.groovy:33)
	at org.codehaus.groovy.eclipse.junit.test.JUnit4TestFinderTests.assertTypeIsTest(JUnit4TestFinderTests.groovy)