Build #466

Build: #466 failed Changes by Oliver Drotbohm

Logs

The following logs have been generated by the jobs in this plan.
  • Expand all
  • Collapse all
Job Logs
Collapse Default Job Default Stage Download or View
20-Sep-2019 15:31:40 Expecting:
20-Sep-2019 15:31:40 <org.springframework.hateoas.mediatype.MessageSourceResolver@5e3db14>
20-Sep-2019 15:31:40 to be equal to:
20-Sep-2019 15:31:40 <INSTANCE>
20-Sep-2019 15:31:40 but was not.
20-Sep-2019 15:31:40 [INFO]
20-Sep-2019 15:31:40 [ERROR] Tests run: 691, Failures: 1, Errors: 0, Skipped: 0
20-Sep-2019 15:31:40 [INFO]
20-Sep-2019 15:31:40 [INFO] ------------------------------------------------------------------------
20-Sep-2019 15:31:40 [INFO] BUILD FAILURE
20-Sep-2019 15:31:40 [INFO] ------------------------------------------------------------------------
20-Sep-2019 15:31:40 [INFO] Total time: 27.408 s
20-Sep-2019 15:31:40 [INFO] Finished at: 2019-09-20T15:31:40Z
20-Sep-2019 15:31:40 [INFO] ------------------------------------------------------------------------
20-Sep-2019 15:31:40 [ERROR] Failed to execute goal org.apache.maven.plugins:maven-surefire-plugin:3.0.0-M3:test (default-test) on project spring-hateoas: There are test failures.
20-Sep-2019 15:31:40 [ERROR]
20-Sep-2019 15:31:40 [ERROR] Please refer to /opt/bamboo-home/xml-data/build-dir/HATEOAS-BUILD-JOB1/target/surefire-reports for the individual test results.
20-Sep-2019 15:31:40 [ERROR] Please refer to dump files (if any exist) [date].dump, [date]-jvmRun[N].dump and [date].dumpstream.
20-Sep-2019 15:31:40 [ERROR] -> [Help 1]
20-Sep-2019 15:31:40 [ERROR]
20-Sep-2019 15:31:40 [ERROR] To see the full stack trace of the errors, re-run Maven with the -e switch.
20-Sep-2019 15:31:40 [ERROR] Re-run Maven using the -X switch to enable full debug logging.
20-Sep-2019 15:31:40 [ERROR]
20-Sep-2019 15:31:40 [ERROR] For more information about the errors and possible solutions, please read the following articles:
20-Sep-2019 15:31:40 [ERROR] [Help 1] http://cwiki.apache.org/confluence/display/MAVEN/MojoFailureException