Build: #16 failed Changes by BoykoAlex <aboyko@pivotal.io>

Build result summary

Details

Completed
Duration
130 minutes
Labels
None
Agent
bamboo-24.af.pivotal.io
Revision
b0ef99241a67c835d2654b7711ec1e7b3fbb8942 b0ef99241a67c835d2654b7711ec1e7b3fbb8942
Total tests
1157
Failing since
#1 (First build for this plan – )
Fixed in
#23 (Changes by Kris De Volder)

Tests

Responsible

Code commits

Author Commit Message Commit date
BoykoAlex <aboyko@pivotal.io> BoykoAlex <aboyko@pivotal.io> b0ef99241a67c835d2654b7711ec1e7b3fbb8942 b0ef99241a67c835d2654b7711ec1e7b3fbb8942 Do not force LS start for embedded manifest editor anymore

Tests

Existing test failures 2
Status Test Failing since View job Duration
java.lang.AssertionError: null
	at org.junit.Assert.fail(Assert.java:86)
	at org.junit.Assert.assertTrue(Assert.java:41)
	at org.junit.Assert.assertFalse(Assert.java:64)
	at org.junit.Assert.assertFalse(Assert.java:74)
	at org.springframework.ide.eclipse.boot.dash.test.BootDashModelTest.testAutoInstallSpringCloudCLICustom(BootDashModelTest.java:233)
org.eclipse.core.runtime.CoreException: FileNotFoundException: /opt/bamboo-home/xml-data/build-dir/HTTPSONLY-IDECITEST-JOB1/plugins/org.springframework.ide.eclipse.boot.launch.test/target/work/data/gradle-test-project/pom.xml (No such file or directory)
	at org.springsource.ide.eclipse.commons.livexp.util.ExceptionUtil.coreException(ExceptionUtil.java:46)
	at org.springframework.ide.eclipse.boot.test.BootProjectTestHarness.assertOk(BootProjectTestHarness.java:369)
	at org.springframework.ide.eclipse.boot.test.BootProjectTestHarness$7.test(BootProjectTestHarness.java:286)
	at org.springsource.ide.eclipse.commons.frameworks.test.util.ACondition.doTest(ACondition.java:143)
	at org.springsource.ide.eclipse.commons.frameworks.test.util.ACondition.waitFor(ACondition.java:103)
	at org.springsource.ide.eclipse.commons.frameworks.test.util.ACondition.<init>(ACondition.java:87)
	at org.springframework.ide.eclipse.boot.test.BootProjectTestHarness$7.<init>(BootProjectTestHarness.java:283)
(22 more lines...)