Build: #3 failed Manual run by Kris De Volder

Build result summary

Details

Completed
Duration
99 minutes
Labels
None
Revision
c827a166077e74afc9ad114d42fd80b1e4490dd0 c827a166077e74afc9ad114d42fd80b1e4490dd0
Total tests
1157
Failing since
#1 (First build for this plan – )

Tests

Responsible

Code commits

Author Commit Message Commit date
Kris De Volder Kris De Volder c827a166077e74afc9ad114d42fd80b1e4490dd0 c827a166077e74afc9ad114d42fd80b1e4490dd0 Fix failing test cases

Tests

New test failures 2
Status Test View job Duration
Collapse Failed BootDashModelTest testAutoInstallSpringCloudCLICustom History
Default Job 25 secs
java.lang.AssertionError: null
	at org.junit.Assert.fail(Assert.java:86)
	at org.junit.Assert.assertTrue(Assert.java:41)
	at org.junit.Assert.assertFalse(Assert.java:64)
	at org.junit.Assert.assertFalse(Assert.java:74)
	at org.springframework.ide.eclipse.boot.dash.test.BootDashModelTest.testAutoInstallSpringCloudCLICustom(BootDashModelTest.java:233)
Collapse Failed BootLaunchConfigurationDelegateTest testRuntimeClasspathNoTestStuffGradle History
Default Job < 1 sec
org.eclipse.core.runtime.CoreException: FileNotFoundException: /opt/bamboo-home/xml-data/build-dir/HTTPSONLY-IDECITEST-JOB1/plugins/org.springframework.ide.eclipse.boot.launch.test/target/work/data/gradle-test-project/pom.xml (No such file or directory)
	at org.springsource.ide.eclipse.commons.livexp.util.ExceptionUtil.coreException(ExceptionUtil.java:46)
	at org.springframework.ide.eclipse.boot.test.BootProjectTestHarness.assertOk(BootProjectTestHarness.java:369)
	at org.springframework.ide.eclipse.boot.test.BootProjectTestHarness$7.test(BootProjectTestHarness.java:286)
	at org.springsource.ide.eclipse.commons.frameworks.test.util.ACondition.doTest(ACondition.java:143)
	at org.springsource.ide.eclipse.commons.frameworks.test.util.ACondition.waitFor(ACondition.java:103)
	at org.springsource.ide.eclipse.commons.frameworks.test.util.ACondition.<init>(ACondition.java:87)
	at org.springframework.ide.eclipse.boot.test.BootProjectTestHarness$7.<init>(BootProjectTestHarness.java:283)
(22 more lines...)